exo,endo,exo-Pentacyclo[6.5.1.1(3,6).0(2,7).0(9,13)]pentadeca-4,10-diene

Condensed phase thermochemistry data

Data compiled by: Hussein Y. Afeefy, Joel F. Liebman, and Stephen E. Stein

Quantity Value Units Method Reference Comment
Δcsolid-8601.5kJ/molCcbBecker and Roth, 1934Corresponding Δfsolid = 126. kJ/mol (simple calculation by NIST; no Washburn corrections)

References

Becker and Roth, 1934
Becker, G.; Roth, W.A., Verbrennungswarmen einiger cyclischer kohlenwasserstoffe, Ber., 1934, 67, 627-632. [all data]