RuF4

Reaction thermochemistry data

Data compiled by: John E. Bartmess

Individual Reactions

Fluorine anion + F4Ru = (Fluorine anion • F4Ru)

By formula: F- + F4Ru = (F- • F4Ru)

Quantity Value Units Method Reference Comment
Δr406. ± 18.kJ/molTDEqKuznetsov, Korobov, et al., 1989gas phase; Fluoride Affinity: 11.0±2.6 kcal.mol < FeF3

Ion clustering data

Data compiled by: John E. Bartmess

Clustering reactions

Fluorine anion + F4Ru = (Fluorine anion • F4Ru)

By formula: F- + F4Ru = (F- • F4Ru)

Quantity Value Units Method Reference Comment
Δr406. ± 18.kJ/molTDEqKuznetsov, Korobov, et al., 1989gas phase; Fluoride Affinity: 11.0±2.6 kcal.mol < FeF3

References

Kuznetsov, Korobov, et al., 1989
Kuznetsov, S.V.; Korobov, M.V.; Sidorov, L.N., Gas-Phase Negative Ion Chemistry of Platinum Metal Fluorides. III. Negative Ions of Pentafluorides., Int. J. Mass Spectrom. Ion Proc., 1989, 91, 3, 283, https://doi.org/10.1016/0168-1176(89)80083-7 . [all data]