Glycine, N,N-dimethyl-, methyl ester

Gas phase thermochemistry data

Data compiled by: Hussein Y. Afeefy, Joel F. Liebman, and Stephen E. Stein

Quantity Value Units Method Reference Comment
Δfgas-370.4 ± 0.79kJ/molCcbVerevkin, Beckhaus, et al., 1992

Condensed phase thermochemistry data

Data compiled by: Hussein Y. Afeefy, Joel F. Liebman, and Stephen E. Stein

Quantity Value Units Method Reference Comment
Δfliquid-414.3 ± 0.67kJ/molCcbVerevkin, Beckhaus, et al., 1992
Quantity Value Units Method Reference Comment
Δcliquid-3125.3 ± 0.63kJ/molCcbVerevkin, Beckhaus, et al., 1992

Phase change data

Data compiled by: Hussein Y. Afeefy, Joel F. Liebman, and Stephen E. Stein

Quantity Value Units Method Reference Comment
Δvap43.93 ± 0.46kJ/molVVerevkin, Beckhaus, et al., 1992

Gas phase ion energetics data

Data compiled as indicated in comments:
LLK - Sharon G. Lias, Rhoda D. Levin, and Sherif A. Kafafi

Ionization energy determinations

IE (eV) Method Reference Comment
7.96 ± 0.03PILoguinov, Takhistov, et al., 1981LLK
7.96 ± 0.05PEAkopyan and Loginov, 1974LLK

Appearance energy determinations

Ion AE (eV) Other Products MethodReferenceComment
C3H8N+8.62 ± 0.05CH3OCOPILoguinov, Takhistov, et al., 1981LLK

References

Verevkin, Beckhaus, et al., 1992
Verevkin, S.P.; Beckhaus, H.-D.; Ruchardt, C., Geminale substituenteneffekte Teil 5α. Standardbildungsenthalpien von alkylsubstituierten Malonsaure- und α-aminocarbonsaureestern, Thermochim. Acta, 1992, 197, 27-39. [all data]

Loguinov, Takhistov, et al., 1981
Loguinov, Y.; Takhistov, V.V.; Vatlina, L.P., Photoionization studies of substituted trimethylamines, Org. Mass Spectrom., 1981, 16, 239. [all data]

Akopyan and Loginov, 1974
Akopyan, M.E.; Loginov, Yu.V., Photoelectron spectra of trimethylamine derivatives, Opt. Spectrosc., 1974, 37, 250, In original 442. [all data]