δ-Dodecalactone

Normal alkane RI, polar column, custom temperature program

Data compiled by: NIST Mass Spectrometry Data Center, William E. Wallace, director

Column type CapillaryCapillaryCapillary
Active phase EC-1000DB-FFAPFFAP
Column length (m)  30.30.
Carrier gas   He
Substrate
Column diameter (mm)  0.320.32
Phase thickness (μm)  0.250.25
Program not specified40C(2min) => 40C/min => 60C(2min) => 6C/min => 180C => 15C/min => 230C(10min)35C(1min) => 40C/min => 60C (1min) => 6C/min => 230C
I 2455.2426.2406.
ReferenceDelabre and Bendall, 9999Buettner, 2007Matsui, Guth, et al., 1998
Comment MSDC-RI MSDC-RI MSDC-RI

Van Den Dool and Kratz RI, non-polar column, custom temperature program

Data compiled by: NIST Mass Spectrometry Data Center, William E. Wallace, director

Column type CapillaryCapillary
Active phase HP-5DB-5MS
Column length (m) 30.30.
Carrier gas He
Substrate
Column diameter (mm) 0.250.25
Phase thickness (μm) 0.250.5
Program 50C => 6C/min => 100C => 4C/min => 280C40C(2min) => 6C/min => 180C => 10C/min => 250C
I 1711.1718.
ReferenceIsidorov, Krajewska, et al., 2001Milo and Reineccius, 1997
Comment MSDC-RI MSDC-RI

Van Den Dool and Kratz RI, non-polar column, temperature ramp

Data compiled by: NIST Mass Spectrometry Data Center, William E. Wallace, director

Column type CapillaryCapillaryCapillaryCapillaryCapillary
Active phase SE-54HP-5MSDB-5MSDB-5MSDB-5
Column length (m) 50.30.30.30.30.
Carrier gas HeHe
Substrate
Column diameter (mm) 0.320.250.250.250.25
Phase thickness (μm)  0.250.250.250.25
Tstart (C) 40.60.40.40.40.
Tend (C) 240.280.200.200.200.
Heat rate (K/min) 8.3.10.10.10.
Initial hold (min) 2. 3.3.5.
Final hold (min) 5. 20.20.15.
I 1725.1702.1675.1705.1730.
ReferenceSchlutt B., Moran N., et al., 2007Kukic J., Petrovic S., et al., 2006Carunchia Whetstine, Croissant, et al., 2005Whetstine, Cadwallader, et al., 2005Avsar, Karagul-Yuceer, et al., 2004
Comment MSDC-RI MSDC-RI MSDC-RI MSDC-RI MSDC-RI
Column type CapillaryCapillaryCapillaryCapillaryCapillary
Active phase DB-5DB-5DB-5DB-5DB-5
Column length (m) 30.30.30.30.30.
Carrier gas   H2H2H2
Substrate
Column diameter (mm) 0.250.320.320.320.32
Phase thickness (μm) 0.250.251.1.1.
Tstart (C) 40.35.40.40.40.
Tend (C) 200.200.210.210.210.
Heat rate (K/min) 10.10.3.3.3.
Initial hold (min) 5.5.
Final hold (min) 15.30.
I 1730.1675.1719.1720.1719.
ReferenceAvsar, Karagul-Yuceer, et al., 2004Karagül-Yüceer, Cadwallader, et al., 2002Moio and Addeo, 1998Moio and Addeo, 1998Moio and Addeo, 1998
Comment MSDC-RI MSDC-RI MSDC-RI MSDC-RI MSDC-RI
Column type CapillaryCapillaryCapillaryPacked
Active phase DB-5DB-5DB-5OV-101
Column length (m) 30.30.30.2.5
Carrier gas H2H2He
Substrate    Gas-Chrom Q
Column diameter (mm) 0.320.320.25
Phase thickness (μm) 1.1.
Tstart (C) 40.40.50.50.
Tend (C) 220.220.250.220.
Heat rate (K/min) 3.3.4.2.
Initial hold (min)
Final hold (min)
I 1720.1721.1681.1670.
ReferenceMoio L., Rillo L., et al., 1996Moio L., Rillo L., et al., 1996Gómez, Ledbetter, et al., 1993Nixon, Wong, et al., 1979
Comment MSDC-RI MSDC-RI MSDC-RI MSDC-RI

References

Delabre and Bendall, 9999
Delabre, M.-L.; Bendall, J.F., Flavour ingredients from fermented dairy streams, Expression of Multidisciplinary Flavour Sci., 9999, 375-378. [all data]

Buettner, 2007
Buettner, A., A selective and sensitive approach to characterize odour-active and volatile constituents in small-scale human milk samples, Flavour Fragr. J., 2007, 22, 6, 465-473, https://doi.org/10.1002/ffj.1822 . [all data]

Matsui, Guth, et al., 1998
Matsui, T.; Guth, H.; Grosch, W., A comparative study of potent odorants in peanut, hazelnut, and pumpkin seed oils on the basis of aroma extract dilution analysis (AEDA) and gas chromatography-olfactometry of headspace samples (GCOH), Lipid - Fett, 1998, 100, 2, 51-56, https://doi.org/10.1002/(SICI)1521-4133(199802)100:2<51::AID-LIPI51>3.0.CO;2-W . [all data]