C10H10O4

Reaction thermochemistry data

Data compiled by: John E. Bartmess

Individual Reactions

C10H9O4- + Hydrogen cation = C10H10O4

By formula: C10H9O4- + H+ = C10H10O4

Quantity Value Units Method Reference Comment
Δr1395. ± 8.8kJ/molG+TSKoppel, Mishima, et al., 1993gas phase
Quantity Value Units Method Reference Comment
Δr1365. ± 8.4kJ/molIMREKoppel, Mishima, et al., 1993gas phase

Gas phase ion energetics data

Data compiled by: John E. Bartmess

De-protonation reactions

C10H9O4- + Hydrogen cation = C10H10O4

By formula: C10H9O4- + H+ = C10H10O4

Quantity Value Units Method Reference Comment
Δr333.3 ± 2.1kcal/molG+TSKoppel, Mishima, et al., 1993gas phase
Quantity Value Units Method Reference Comment
Δr326.3 ± 2.0kcal/molIMREKoppel, Mishima, et al., 1993gas phase

References

Koppel, Mishima, et al., 1993
Koppel, I.A.; Mishima, M.; Stock, L.M.; Taft, R.W.; Topsom, R.D., Acidities of 4-Substituted Benzoic, Bicyclo[2.2.2]Oct-1-yl and Bicyclo[2.2.2]Oct-2-enyl Carboxylic Acids, J. Phys. Org. Chem., 1993, 6, 12, 685, https://doi.org/10.1002/poc.610061205 . [all data]