NaCS2

Gas phase ion energetics data

Data compiled by: John E. Bartmess

Electron affinity determinations

EA (eV) Method Reference Comment
0.800 ± 0.050LPESMisaizu, Tsunoyama, et al., 2004Vertical Detachment Energy: 1.05±0.05 eV

References

Misaizu, Tsunoyama, et al., 2004
Misaizu, F.; Tsunoyama, H.; Yasumura, Y.; Ohshimo, K.; Ohno, K., Photoelectron spectroscopy and density functional theory calculation of Na-n(CS2)(-) cluster negative ions for n=1 and 2, Chem. Phys. Lett., 2004, 389, 4-6, 241-246, https://doi.org/10.1016/j.cplett.2004.03.098 . [all data]