Iron, hexacarbonyl[η-[heptahydrotriborato-(2-)]]di-, (fe-fe)

Gas phase ion energetics data

Data compiled by: Sharon G. Lias, Rhoda D. Levin, and Sherif A. Kafafi

Ionization energy determinations

IE (eV) Method Reference Comment
7.6PEAndersen, DeKock, et al., 1981
8.5PEAndersen, DeKock, et al., 1981Vertical value

References

Andersen, DeKock, et al., 1981
Andersen, E.L.; DeKock, R.L.; Fehlner, T.P., Electronic structure of diiron ferraboranes, Inorg. Chem., 1981, 20, 3291. [all data]