19-Nor-17α-ethynyl-17β-(benzoyloxy-4-androsten-3-one

Phase change data

Data compiled as indicated in comments:
TRC - Thermodynamics Research Center, NIST Boulder Laboratories, Chris Muzny director
AC - William E. Acree, Jr., James S. Chickos

Quantity Value Units Method Reference Comment
Tfus531.0KN/ALewis and Enever, 1979Uncertainty assigned by TRC = 1. K; TRC

Enthalpy of fusion

ΔfusH (kcal/mol) Temperature (K) Reference Comment
9.92531.Domalski and Hearing, 1996AC

In addition to the Thermodynamics Research Center (TRC) data available from this site, much more physical and chemical property data is available from the following TRC products:

References

Lewis and Enever, 1979
Lewis, G.A.; Enever, R.P., Solution thermodynamics of some potentially long-acting norethindrone derivatives. I. Variation of enthalpies and entropies of fusion with temp., Int. J. Pharm., 1979, 22, 203. [all data]

Domalski and Hearing, 1996
Domalski, Eugene S.; Hearing, Elizabeth D., Heat Capacities and Entropies of Organic Compounds in the Condensed Phase. Volume III, J. Phys. Chem. Ref. Data, 1996, 25, 1, 1, https://doi.org/10.1063/1.555985 . [all data]