1-Hexene, 5,5-dimethyl-

Phase change data

Data compiled as indicated in comments:
TRC - Thermodynamics Research Center, NIST Boulder Laboratories, Chris Muzny director
AC - William E. Acree, Jr., James S. Chickos

Quantity Value Units Method Reference Comment
Tboil374.KN/AChel'tsova, Chernyshev, et al., 1955Uncertainty assigned by TRC = 4. K; TRC
Tboil376.3KN/AWhitmore, Whitmore, et al., 1950Uncertainty assigned by TRC = 0.5 K; TRC
Quantity Value Units Method Reference Comment
Δvap9.01kcal/molN/AReid, 1972AC

In addition to the Thermodynamics Research Center (TRC) data available from this site, much more physical and chemical property data is available from the following TRC products:

References

Chel'tsova, Chernyshev, et al., 1955
Chel'tsova, M.A.; Chernyshev, E.A.; Petrov, A.D., Behaviour of Alkenyl Halides with Unsaturated Bond in γ-, δ, ε-Postion in Condenstation Reactions with Alkyl Halides in the Presence of Magnesium, Izv. Akad. Nauk SSSR, 1955, 1955, 522-7. [all data]

Whitmore, Whitmore, et al., 1950
Whitmore, F.C.; Whitmore, H.E.; Cook, N.C., Hydrocarbons: X. Three New Octenes, J. Am. Chem. Soc., 1950, 72, 51. [all data]

Reid, 1972
Reid, Robert C., Handbook on vapor pressure and heats of vaporization of hydrocarbons and related compounds, R. C. Wilhort and B. J. Zwolinski, Texas A Research Foundation. College Station, Texas(1971). 329 pages.$10.00, AIChE J., 1972, 18, 6, 1278-1278, https://doi.org/10.1002/aic.690180637 . [all data]