C7H10OSi

Gas phase ion energetics data

Data compiled by: John E. Bartmess

De-protonation reactions

C7H9OSi- + Hydrogen cation = C7H10OSi

By formula: C7H9OSi- + H+ = C7H10OSi

Quantity Value Units Method Reference Comment
Δr1491. ± 17.kJ/molG+TSDamrauer, Simon, et al., 1991gas phase; Between MeSH, MeNO2
Quantity Value Units Method Reference Comment
Δr1464. ± 17.kJ/molIMRBDamrauer, Simon, et al., 1991gas phase; Between MeSH, MeNO2

References

Damrauer, Simon, et al., 1991
Damrauer, R.; Simon, R.; Krempp, M., Effect of Substituents on the Gas-Phase Acidity of Silanols, J. Am. Chem. Soc., 1991, 113, 12, 4431, https://doi.org/10.1021/ja00012a009 . [all data]