Pyridine, 5-hexyl-2-methyl-

Normal alkane RI, non-polar column, temperature ramp

Data compiled by: NIST Mass Spectrometry Data Center, William E. Wallace, director

Column type Capillary
Active phase SPB-1
Column length (m) 60.
Carrier gas
Substrate
Column diameter (mm)
Phase thickness (μm)
Tstart (C) 80.
Tend (C) 230.
Heat rate (K/min) 5.
Initial hold (min)
Final hold (min)
I 1410.
ReferenceThomas and Bassols, 1992
Comment MSDC-RI

Normal alkane RI, polar column, temperature ramp

View large format table.

Column type Active phase I Reference Comment
CapillarySupelcowax1837.Thomas and Bassols, 19925. K/min; Column length: 60. m; Tstart: 80. C; Tend: 230. C

References

Thomas and Bassols, 1992
Thomas, A.F.; Bassols, F., Occurrence of pyridines and other bases in orange oil, J. Agric. Food Chem., 1992, 40, 11, 2236-2243, https://doi.org/10.1021/jf00023a037 . [all data]