cis-1,2-Diethylcyclopropane

Gas phase thermochemistry data

Data compiled by: Hussein Y. Afeefy, Joel F. Liebman, and Stephen E. Stein

Quantity Value Units Method Reference Comment
Δfgas-44.6 ± 1.6kJ/molCcbWiberg, Lupton, et al., 1984see Lupton, 1970

Condensed phase thermochemistry data

Data compiled by: Hussein Y. Afeefy, Joel F. Liebman, and Stephen E. Stein

Quantity Value Units Method Reference Comment
Δfliquid-80.0 ± 1.4kJ/molCcbWiberg, Lupton, et al., 1984see Lupton, 1970
Quantity Value Units Method Reference Comment
Δcliquid-4675. ± 1.kJ/molCcbWiberg, Lupton, et al., 1984see Lupton, 1970; Corresponding Δfliquid = -79.87 kJ/mol (simple calculation by NIST; no Washburn corrections)

References

Wiberg, Lupton, et al., 1984
Wiberg, K.B.; Lupton, E.C., Jr.; Wasserman, D.J.; de Meijere, A., Enthalpies of formation of cis- and trans-1,2-diethylcyclopropane and cis- and trans-bicyclo[6.1.0]nonane. Structural effects on energies of cyclopropane rings, J. Am. Chem. Soc., 1984, 106, 1740-1744. [all data]

Lupton, 1970
Lupton, E.C., Jr., The thermochemistry of some small ring compounds, Diss. Abs., 1970, 31, 1174-1175. [all data]