trans-1,2-Diethyl-cyclopropane

Gas phase thermochemistry data

Data compiled by: Hussein Y. Afeefy, Joel F. Liebman, and Stephen E. Stein

Quantity Value Units Method Reference Comment
Δfgas-49.1 ± 1.8kJ/molCcbWiberg, Lupton, et al., 1984see Lupton, 1970

Condensed phase thermochemistry data

Data compiled by: Hussein Y. Afeefy, Joel F. Liebman, and Stephen E. Stein

Quantity Value Units Method Reference Comment
Δfliquid-83.4 ± 1.6kJ/molCcbWiberg, Lupton, et al., 1984see Lupton, 1970
Quantity Value Units Method Reference Comment
Δcliquid-4672.1 ± 1.5kJ/molCcbWiberg, Lupton, et al., 1984see Lupton, 1970; Corresponding Δfliquid = -83.26 kJ/mol (simple calculation by NIST; no Washburn corrections)

Phase change data

Data compiled as indicated in comments:
TRC - Thermodynamics Research Center, NIST Boulder Laboratories, Chris Muzny director
ALS - Hussein Y. Afeefy, Joel F. Liebman, and Stephen E. Stein
DRB - Donald R. Burgess, Jr.

Quantity Value Units Method Reference Comment
Tboil359.65KN/ASimmons and Smith, 1959Uncertainty assigned by TRC = 2. K; TRC
Quantity Value Units Method Reference Comment
Δvap34.3 ± 0.84kJ/molEWiberg, Lupton, et al., 1984see Lupton, 1970; ALS
Δvap34.3kJ/molN/AWiberg, Lupton, et al., 1984DRB

In addition to the Thermodynamics Research Center (TRC) data available from this site, much more physical and chemical property data is available from the following TRC products:

Kovats' RI, non-polar column, isothermal

View large format table.

Column type Active phase Temperature (C) I Reference Comment
PackedSqualane60.663.Bogoslovsky, Anvaer, et al., 1978
CapillarySqualane60.662.8Schomburg and Dielmann, 1973Column length: 100. m; Column diameter: 0.25 mm

References

Wiberg, Lupton, et al., 1984
Wiberg, K.B.; Lupton, E.C., Jr.; Wasserman, D.J.; de Meijere, A., Enthalpies of formation of cis- and trans-1,2-diethylcyclopropane and cis- and trans-bicyclo[6.1.0]nonane. Structural effects on energies of cyclopropane rings, J. Am. Chem. Soc., 1984, 106, 1740-1744. [all data]

Lupton, 1970
Lupton, E.C., Jr., The thermochemistry of some small ring compounds, Diss. Abs., 1970, 31, 1174-1175. [all data]

Simmons and Smith, 1959
Simmons, H.E.; Smith, R.D., A New Synthesis of Cyclopropanes, J. Am. Chem. Soc., 1959, 81, 4256. [all data]

Bogoslovsky, Anvaer, et al., 1978
Bogoslovsky, Yu.N.; Anvaer, B.I.; Vigdergauz, M.S., Chromatographic constants in gas chromatography (in Russian), Standards Publ. House, Moscow, 1978, 192. [all data]

Schomburg and Dielmann, 1973
Schomburg, G.; Dielmann, G., Use of retention increments for identification and correlation of saturated and unsaturated cyclopropane hydrocarbons by means of Kovats indices, Anal. Chem., 1973, 45, 9, 1647-1658, https://doi.org/10.1021/ac60331a021 . [all data]