2-Azabicyclo[3.2.1]oct-6-ene,2-(phenylsulfonyl)-

Gas phase ion energetics data

Data compiled by: Sharon G. Lias, Rhoda D. Levin, and Sherif A. Kafafi

Ionization energy determinations

IE (eV) Method Reference
8.79PEBarraclough, Bilgic, et al., 1979

References

Barraclough, Bilgic, et al., 1979
Barraclough, P.; Bilgic, S.; Pedley, J.B.; Rogers, A.J.; Young, D.W., Conjugative and homoconjugative effects in 2-heterobicyclo[3.2.1]octa-3,6-dienes, Tetrahedron, 1979, 35, 99. [all data]