3-Hexene, 2,5-dimethyl-3,4-bis(1-methylethyl)-

Gas phase ion energetics data

Data compiled by: Sharon G. Lias, Rhoda D. Levin, and Sherif A. Kafafi

Ionization energy determinations

IE (eV) Method Reference Comment
8.13PEMollere, Houk, et al., 1976Vertical value

References

Mollere, Houk, et al., 1976
Mollere, P.D.; Houk, K.N.; Bomse, D.S.; Morton, T.H., Photoelectron spectra of sterically congested alkenes and dienes, J. Am. Chem. Soc., 1976, 98, 4732. [all data]