1,7-Diazabicyclo[3.2.1]octane, 2-methyl-

Gas phase ion energetics data

Data compiled as indicated in comments:
LBLHLM - Sharon G. Lias, John E. Bartmess, Joel F. Liebman, John L. Holmes, Rhoda D. Levin, and W. Gary Mallard
LLK - Sharon G. Lias, Rhoda D. Levin, and Sherif A. Kafafi

Ionization energy determinations

IE (eV) Method Reference Comment
8.51PENelsen, 1984Vertical value; LBLHLM
8.18PENelsen, Kessel, et al., 1979Vertical value; LLK

References

Nelsen, 1984
Nelsen, S.F., Ionization from nitrogen and oxygen lone pairs: A comparison of trialkylamine, dialkyl ether, tetraalkylhydrazine, and dialkyl peroxide photoelectron spectroscopic ionization potentials, J. Org. Chem., 1984, 49, 1891. [all data]

Nelsen, Kessel, et al., 1979
Nelsen, S.F.; Kessel, C.R.; Brace, H.N., Twisted and bent hydrazine radical cations, J. Am. Chem. Soc., 1979, 101, 1874. [all data]