3,6-Dimethyl-2,3,3a,4,5,7a-hexahydrobenzofuran

Van Den Dool and Kratz RI, non-polar column, custom temperature program

View large format table.

Column type Active phase I Reference Comment
CapillaryHP-5MS1178.Pérez, Navarro, et al., 200730. m/0.25 mm/0.25 μm, He; Program: 50C(4min) => 10C/min => 200C(0.5min) => 20C/min => 260C(5min)

Normal alkane RI, non-polar column, temperature ramp

View large format table.

Column type Active phase I Reference Comment
CapillaryRSL-2001192.Jirovetz, Buchbauer, et al., 200330. m/0.25 mm/0.25 μm, H2, 40. C @ 2. min, 6. K/min, 280. C @ 10. min

Normal alkane RI, non-polar column, custom temperature program

View large format table.

Column type Active phase I Reference Comment
CapillarySE-541235.Blank, Fischer, et al., 198930. m/0.32 mm/0.3 μm, He; Program: 35C(2min) => 40C/min => 50C(2min) => 6C/min => 230C(10min)
CapillarySE-541235.Blank, Fischer, et al., 198930. m/0.32 mm/0.3 μm, He; Program: 35C(2min) => 40C/min => 50C(2min) => 6C/min => 230C(10min)

Normal alkane RI, polar column, custom temperature program

View large format table.

Column type Active phase I Reference Comment
CapillaryHP-Innowax1527.Piasenzotto, Gracco, et al., 200330. m/0.32 mm/0.5 μm, He; Program: 50C(4min) => 10C/min => 230C(10min) => 10C/min => 250C
CapillaryDB-Wax1545.Schneider, Razungles, et al., 200130. m/0.25 mm/0.5 μm, He; Program: 30C => 70C/min => 60C (3min) => 3C/min => 245C (20min)

References

Pérez, Navarro, et al., 2007
Pérez, R.A.; Navarro, T.; de Lorenzo, C., HS-SPME analysis of the volatile compounds from spices as a source of flavour in 'Campo Real' table olive preparations, Flavour Fragr. J., 2007, 22, 4, 265-273, https://doi.org/10.1002/ffj.1791 . [all data]

Jirovetz, Buchbauer, et al., 2003
Jirovetz, L.; Buchbauer, G.; Stoyanova, A.S.; Georgiev, E.V.; Damianova, S.T., Composition, quality control, and antimicrobial activity of the essential oil of long-time stored dill (Anethum graveolens L.) seeds from Bulgaria, J. Agric. Food Chem., 2003, 51, 13, 3854-3857, https://doi.org/10.1021/jf030004y . [all data]

Blank, Fischer, et al., 1989
Blank, I.; Fischer, K.-H.; Grosch, W., Intensive neutral odourants of linden honey, Z. Lebensm. Unters. Forsch., 1989, 189, 5, 426-433, https://doi.org/10.1007/BF01028316 . [all data]

Piasenzotto, Gracco, et al., 2003
Piasenzotto, L.; Gracco, L.; Conte, L., Solid phase microextraction (SPME) applied to honey quality control, J. Sci. Food Agric., 2003, 83, 10, 1037-1044, https://doi.org/10.1002/jsfa.1502 . [all data]

Schneider, Razungles, et al., 2001
Schneider, R.; Razungles, A.; Augier, C.; Baumes, R., Monoterpenic and norisoprenoidic glycoconjugates of Vitis vinifera L. cv. Melon B. as precursors of odorants in Muscadet wines, J. Chromatogr. A, 2001, 936, 1-2, 145-157, https://doi.org/10.1016/S0021-9673(01)01150-5 . [all data]