1,3,5-Trimethyladamantane

Gas phase thermochemistry data

Data compiled by: Hussein Y. Afeefy, Joel F. Liebman, and Stephen E. Stein

Quantity Value Units Method Reference Comment
Δfgas-255. ± 4.2kJ/molCcbSteele and Watt, 1977

Condensed phase thermochemistry data

Data compiled by: Hussein Y. Afeefy, Joel F. Liebman, and Stephen E. Stein

Quantity Value Units Method Reference Comment
Δfsolid-333. ± 4.2kJ/molCcbSteele and Watt, 1977
Quantity Value Units Method Reference Comment
Δcsolid-7927.4 ± 4.2kJ/molCcbSteele and Watt, 1977Corresponding Δfsolid = -332. kJ/mol (simple calculation by NIST; no Washburn corrections)

Phase change data

Data compiled as indicated in comments:
TRC - Thermodynamics Research Center, NIST Boulder Laboratories, Chris Muzny director
AC - William E. Acree, Jr., James S. Chickos
ALS - Hussein Y. Afeefy, Joel F. Liebman, and Stephen E. Stein
DRB - Donald R. Burgess, Jr.
CAL - James S. Chickos, William E. Acree, Jr., Joel F. Liebman, Students of Chem 202 (Introduction to the Literature of Chemistry), University of Missouri -- St. Louis

Quantity Value Units Method Reference Comment
Tfus253.6KN/AClark, Knox, et al., 1977Crystal phase 1 phase; Uncertainty assigned by TRC = 0.2 K; TRC
Quantity Value Units Method Reference Comment
Δvap51.7 ± 0.2kJ/molN/ADruzhinina, Varushchenko, et al., 2000See also Melkhanova, Pimenova, et al., 2000.; AC
Quantity Value Units Method Reference Comment
Δsub78. ± 1.kJ/molVSteele and Watt, 1977ALS
Δsub78.0kJ/molN/ASteele and Watt, 1977DRB
Δsub77.8 ± 1.3kJ/molBGSteele and Watt, 1977Based on data from 300. - 360. K.; AC

Enthalpy of fusion

ΔfusH (kJ/mol) Temperature (K) Reference Comment
1.73253.6Clark, Knox, et al., 1977AC

Entropy of fusion

ΔfusS (J/mol*K) Temperature (K) Reference Comment
27.61228.2Clark, Knox, et al., 1977CAL
6.82253.6

In addition to the Thermodynamics Research Center (TRC) data available from this site, much more physical and chemical property data is available from the following TRC products:

Kovats' RI, non-polar column, temperature ramp

Data compiled by: NIST Mass Spectrometry Data Center, William E. Wallace, director

Column type Capillary
Active phase HP-5MS
Column length (m) 30.
Carrier gas
Substrate
Column diameter (mm) 0.25
Phase thickness (μm) 0.25
Tstart (C) 50.
Tend (C) 300.
Heat rate (K/min) 6.
Initial hold (min) 2.
Final hold (min)
I 1128.
ReferenceYang, Wang, et al., 2006
Comment MSDC-RI

Kovats' RI, non-polar column, isothermal

Data compiled by: NIST Mass Spectrometry Data Center, William E. Wallace, director

Column type CapillaryCapillaryCapillaryCapillaryCapillary
Active phase SE-30SE-30SE-30SE-30SE-30
Column length (m) 50.
Carrier gas He
Substrate
Column diameter (mm) 0.2
Phase thickness (μm)
Temperature (C) 190.110.120.130.140.
I 1194.1143.1148.1152.1157.
ReferenceSarkisova and Pimerzin, 2005Bogoslovsky, Anvaer, et al., 1978Bogoslovsky, Anvaer, et al., 1978Bogoslovsky, Anvaer, et al., 1978Bogoslovsky, Anvaer, et al., 1978
Comment MSDC-RI MSDC-RI MSDC-RI MSDC-RI MSDC-RI
Column type CapillaryCapillaryCapillaryCapillaryPacked
Active phase SE-30SqualaneSqualaneSqualaneSE-30
Column length (m)     6.1
Carrier gas     N2
Substrate     Chrom W
Column diameter (mm)
Phase thickness (μm)
Temperature (C) 145.110.125.140.120.
I 1163.1153.1161.1170.1148.
ReferenceBogoslovsky, Anvaer, et al., 1978Bogoslovsky, Anvaer, et al., 1978Bogoslovsky, Anvaer, et al., 1978Bogoslovsky, Anvaer, et al., 1978Mitra, Mohan, et al., 1974
Comment MSDC-RI MSDC-RI MSDC-RI MSDC-RI MSDC-RI
Column type PackedPackedCapillaryCapillaryCapillary
Active phase SE-30SE-30SqualaneApiezon LSqualane
Column length (m) 6.16.150.50.50.
Carrier gas N2N2H2N2N2
Substrate Chrom WChrom W
Column diameter (mm)   0.20.20.2
Phase thickness (μm)
Temperature (C) 130.140.100.140.110.
I 1152.1157.1147.1204.1153.
ReferenceMitra, Mohan, et al., 1974Mitra, Mohan, et al., 1974Mitra, Mohan, et al., 1974, 2Hála, Eyem, et al., 1970Hála, Eyem, et al., 1970
Comment MSDC-RI MSDC-RI MSDC-RI MSDC-RI MSDC-RI
Column type CapillaryCapillaryCapillaryCapillaryCapillary
Active phase SqualaneSqualaneSE-30SE-30SE-30
Column length (m) 50.50.50.50.50.
Carrier gas N2N2N2N2N2
Substrate
Column diameter (mm) 0.20.20.270.270.27
Phase thickness (μm)
Temperature (C) 125.140.145.160.175.
I 1161.1170.1163.1173.1185.
ReferenceHála, Eyem, et al., 1970Hála, Eyem, et al., 1970Burkhard, Vais, et al., 1969Burkhard, Vais, et al., 1969Burkhard, Vais, et al., 1969
Comment MSDC-RI MSDC-RI MSDC-RI MSDC-RI MSDC-RI
Column type Capillary
Active phase SE-30
Column length (m) 50.
Carrier gas N2
Substrate
Column diameter (mm) 0.27
Phase thickness (μm)
Temperature (C) 190.
I 1194.
ReferenceBurkhard, Vais, et al., 1969
Comment MSDC-RI

References

Steele and Watt, 1977
Steele, W.V.; Watt, I., The standard enthalpies of formation of adamantanoid compounds 4. Methyladamantanes, J. Chem. Thermodyn., 1977, 9, 843-849. [all data]

Clark, Knox, et al., 1977
Clark, Timothy; Knox, Trevor Mc.O.; Mackle, Henry; McKervey, M. Anthony, Order--disorder transitions in substituted adamantanes, J. Chem. Soc., Faraday Trans. 1, 1977, 73, 0, 1224, https://doi.org/10.1039/f19777301224 . [all data]

Druzhinina, Varushchenko, et al., 2000
Druzhinina, A.I.; Varushchenko, R.M.; Sarkisova, V.S.; Pimerzin, A.A., The low-temperature heat capacity and the thermodynamic functions of 1,3,5-trimethyladamantane, Zh. Fiz. Khim., 2000, 74, 3, 404. [all data]

Melkhanova, Pimenova, et al., 2000
Melkhanova, S.V.; Pimenova, S.M.; Kolesov, V.P.; Pimerzin, A.A.; Sarkisova, V.S., The standard molar enthalpies of formation of some alkyladamantanes, The Journal of Chemical Thermodynamics, 2000, 32, 10, 1311-1317, https://doi.org/10.1006/jcht.2000.0691 . [all data]