2-Cyclohexen-1-one, 4-hydroxy-3,5,5-trimethyl-4-(3-oxo-1-butenyl)-

Van Den Dool and Kratz RI, non-polar column, temperature ramp

View large format table.

Column type Active phase I Reference Comment
CapillaryBP-11729.Tan, Wilkins, et al., 1989H2, 40. C @ 2. min, 4. K/min, 240. C @ 75. min; Column length: 12. m

Normal alkane RI, non-polar column, custom temperature program

View large format table.

Column type Active phase I Reference Comment
CapillaryCP Sil 5 CB1760.Guyot-Declerck, Chevance, et al., 200050. m/0.32 mm/1.2 μm, He; Program: 36 0C 20 K/min -> 85 0C 1 K/min -> 145 oC 3 K/min -> 250 0C
CapillaryCP Sil 5 CB1757.Guyot, Scheirman, et al., 1999He; Column length: 50. m; Column diameter: 0.32 mm; Program: 30C => 55C/min => 85C => 1C/min => 145C => 3C/min => 250C

References

Tan, Wilkins, et al., 1989
Tan, S.T.; Wilkins, A.L.; Holland, P.T.; McGhie, T.K., Extractives from New Zealand unifloral honeys. 2. Degraded carotenoids and other substances from heather honey, J. Agric. Food Chem., 1989, 37, 5, 1217-1221, https://doi.org/10.1021/jf00089a004 . [all data]

Guyot-Declerck, Chevance, et al., 2000
Guyot-Declerck, C.; Chevance, F.; Lermusieau, G.; Collin, S., Optimized extraction procedure for quantifying norisoprenoids in honey and honey food products, J. Agric. Food Chem., 2000, 48, 12, 5850-5855, https://doi.org/10.1021/jf000504g . [all data]

Guyot, Scheirman, et al., 1999
Guyot, C.; Scheirman, V.; Collin, S., Floral origin markers of heather honeys: Calluna vulgaris and Erica arborea, Food Chem., 1999, 64, 1, 3-11, https://doi.org/10.1016/S0308-8146(98)00122-8 . [all data]