Cyclopentene, octachloro-

Normal alkane RI, non-polar column, temperature ramp

View large format table.

Column type Active phase I Reference Comment
CapillaryHP-11601.8Dearth and Hites, 1991H2, 50. C @ 1. min, 3. K/min; Column length: 30. m; Column diameter: 0.25 mm; Tend: 320. C
CapillaryDB-51618.8Dearth and Hites, 1991H2, 50. C @ 1. min, 3. K/min; Column length: 30. m; Column diameter: 0.25 mm; Tend: 320. C

References

Dearth and Hites, 1991
Dearth, M.A.; Hites, R.A., Complete analysis of technical chlordane using negative ionization mass spectrometry, Environ. Sci. Technol., 1991, 25, 2, 245-254, https://doi.org/10.1021/es00014a005 . [all data]