2H-Pyran-2-one, tetrahydro-6-pentyl-

Van Den Dool and Kratz RI, non-polar column, temperature ramp

Data compiled by: NIST Mass Spectrometry Data Center, William E. Wallace, director

Column type CapillaryCapillaryCapillaryCapillaryCapillary
Active phase DB-5MSSE-54HP-5DB-5MSDB-5MS
Column length (m) 30.50.60.60.60.
Carrier gas HeHeHeH2H2
Substrate
Column diameter (mm) 0.250.320.250.250.25
Phase thickness (μm) 0.25 0.250.250.25
Tstart (C) 35.40.60.30.30.
Tend (C) 225.240.250.250.250.
Heat rate (K/min) 10.8.3.2.2.
Initial hold (min) 5.2. 2.2.
Final hold (min) 25.5. 2.2.
I 1463.1510.1504.1487.1490.
ReferenceLozano P.R., Miracle E.R., et al., 2007Schlutt B., Moran N., et al., 2007Perraudin, Popovici, et al., 2006Schwambach and Peterson, 2006Schwambach and Peterson, 2006
Comment MSDC-RI MSDC-RI MSDC-RI MSDC-RI MSDC-RI
Column type CapillaryCapillaryCapillaryCapillaryCapillary
Active phase DB-5MSDB-5MSDB-5HP-5HP-5
Column length (m) 30.30.30.30.30.
Carrier gas He N2HeHe
Substrate
Column diameter (mm) 0.250.250.250.250.25
Phase thickness (μm) 0.250.250.250.250.25
Tstart (C) 40.40.30.50.50.
Tend (C) 200.200.250.250.250.
Heat rate (K/min) 5.10.3.4.4.
Initial hold (min) 5.3.2.5.5.
Final hold (min) 45.20.2.15.15.
I 1510.1510.1494.1505.1474.
ReferenceCarunchia Whetstine, Croissant, et al., 2005Carunchia Whetstine, Croissant, et al., 2005Colahan-Sederstrom and Peterson, 2005Mahattanatawee, Goodner, et al., 2005Mahattanatawee, Goodner, et al., 2005
Comment MSDC-RI MSDC-RI MSDC-RI MSDC-RI MSDC-RI
Column type CapillaryCapillaryCapillaryCapillaryCapillary
Active phase HP-5MSDB-5MSDB-5DB-5MSDB-5
Column length (m) 30.30.30.30.30.
Carrier gas He HeHe
Substrate
Column diameter (mm) 0.250.250.320.250.25
Phase thickness (μm) 0.250.251.0.250.25
Tstart (C) 60.40.40.35.35.
Tend (C) 250.200.230.200.250.
Heat rate (K/min) 4.10.5.10.4.
Initial hold (min) 2.3.4.5.2.
Final hold (min) 20.20.10.30.4.
I 1496.1481.1491.1494.1492.
ReferencePino, Mesa, et al., 2005Whetstine, Cadwallader, et al., 2005Mahajan, Goddik, et al., 2004Karagül-Yüceer, Vlahovich, et al., 2003Peterson and Reineccius, 2003
Comment MSDC-RI MSDC-RI MSDC-RI MSDC-RI MSDC-RI
Column type CapillaryCapillaryCapillaryCapillaryCapillary
Active phase DB-5DB-5DB-5DB-5DB-5
Column length (m) 30.60.30.30.30.
Carrier gas  He  H2
Substrate
Column diameter (mm) 0.250.250.320.320.32
Phase thickness (μm) 0.250.250.250.251.
Tstart (C) 35.40.35.35.40.
Tend (C) 250.275.200.200.210.
Heat rate (K/min) 4.7.10.10.3.
Initial hold (min) 2. 5.5.
Final hold (min) 4. 30.30.
I 1492.1503.1490.1502.1510.
ReferencePeterson and Reineccius, 2003, 2Valim, Rouseff, et al., 2003Karagül-Yüceer, Cadwallader, et al., 2002Karagül-Yüceer, Drake, et al., 2001Moio and Addeo, 1998
Comment MSDC-RI MSDC-RI MSDC-RI MSDC-RI MSDC-RI
Column type CapillaryCapillaryCapillaryCapillaryCapillary
Active phase DB-5DB-5DB-5DB-5DB-5
Column length (m) 30.30.30.30.30.
Carrier gas H2H2H2H2He
Substrate
Column diameter (mm) 0.320.320.320.320.25
Phase thickness (μm) 1.1.1.1.
Tstart (C) 40.40.40.40.50.
Tend (C) 210.210.220.220.250.
Heat rate (K/min) 3.3.3.3.4.
Initial hold (min)
Final hold (min)
I 1510.1510.1504.1507.1493.
ReferenceMoio and Addeo, 1998Moio and Addeo, 1998Moio L., Rillo L., et al., 1996Moio L., Rillo L., et al., 1996Gómez, Ledbetter, et al., 1993
Comment MSDC-RI MSDC-RI MSDC-RI MSDC-RI MSDC-RI
Column type CapillaryCapillary
Active phase SE-30DB-5
Column length (m) 22.0.32
Carrier gas N2H2
Substrate
Column diameter (mm) 0.301.
Phase thickness (μm) 1.0
Tstart (C) 60.30.
Tend (C) 250.180.
Heat rate (K/min) 2.1.5
Initial hold (min)  5.
Final hold (min)
I 1446.1499.
Referencede Frutos, Sanz, et al., 1991Guichard and Souty, 1988
Comment MSDC-RI MSDC-RI

Normal alkane RI, non-polar column, temperature ramp

Data compiled by: NIST Mass Spectrometry Data Center, William E. Wallace, director

Column type CapillaryCapillaryCapillaryCapillaryCapillary
Active phase HP-5 MSDB-5DB-5HP-5MSDB-5
Column length (m) 30.60.60.30.60.
Carrier gas HeliumHeliumHeliumHeHe
Substrate
Column diameter (mm) 0.250.320.320.250.32
Phase thickness (μm) 0.250.250.250.25
Tstart (C) 50.  60.60.
Tend (C) 250.240.240.250.250.
Heat rate (K/min) 5.6.6.2.4.
Initial hold (min) 0.5  8.5.
Final hold (min) 0.55.5.15.
I 1495.1509.1469.1491.1519.
ReferenceFanaro, Duarte, et al., 2012Mallia, Escher, et al., 2009Mallia, Escher, et al., 2009Ferhat, Tigrine-Kordjani, et al., 2007Fadel, Mageed, et al., 2006
Comment MSDC-RI MSDC-RI MSDC-RI MSDC-RI MSDC-RI
Column type CapillaryCapillaryCapillaryCapillaryCapillary
Active phase DB-5 MSHP-5 MSSPB-5DB-5MSBP-5
Column length (m) 30.30.30.30.50.
Carrier gas  HeliumHeliumHeHe
Substrate
Column diameter (mm) 0.250.250.250.320.32
Phase thickness (μm) 0.250.250.250.251.
Tstart (C) 40.60.60.40.40.
Tend (C) 200.250.250.195.190.
Heat rate (K/min) 8.2.4.5.2.
Initial hold (min) 3.8.2.5.5.
Final hold (min) 20.15.20.40.
I 1471.1491.1493.1490.1505.
ReferenceSchirack, Drake, et al., 2006Tigrine-Kordiani, Meklati, et al., 2006Pino, Marbot, et al., 2002Suriyaphan, Drake, et al., 2001Lopez, Ferreira, et al., 1999
Comment MSDC-RI MSDC-RI MSDC-RI MSDC-RI MSDC-RI
Column type CapillaryCapillaryCapillaryCapillaryCapillary
Active phase DB-5 MSDB-5DB-5DB-1DB-1
Column length (m) 60.30.30.30.30.
Carrier gas HeliumH2H2HeHe
Substrate
Column diameter (mm) 0.320.320.320.250.25
Phase thickness (μm) 0.251.1.1.01.0
Tstart (C) 40.40.40.40.40.
Tend (C) 200.220.220.250.250.
Heat rate (K/min) 3.3.3.3.3.
Initial hold (min) 5.
Final hold (min) 30.  30.30.
I 1494.1501.1507.1455.1463.
ReferenceSuriyaphan, Drake, et al., 1999Moio, Dekimpe, et al., 1993Moio, Dekimpe, et al., 1993Peppard, 1992Peppard, 1992
Comment MSDC-RI MSDC-RI MSDC-RI MSDC-RI MSDC-RI
Column type CapillaryCapillary
Active phase DB-1DB-5
Column length (m) 60.30.
Carrier gas HeHe
Substrate
Column diameter (mm) 0.3150.25
Phase thickness (μm) 0.250.25
Tstart (C) 50.40.
Tend (C) 250.250.
Heat rate (K/min) 4.2.
Initial hold (min)
Final hold (min)
I 1447.1496.
ReferenceEngel, Flath, et al., 1988Güntert, Rapp, et al., 1986
Comment MSDC-RI MSDC-RI

Normal alkane RI, polar column, custom temperature program

Data compiled by: NIST Mass Spectrometry Data Center, William E. Wallace, director

Column type CapillaryCapillaryCapillaryCapillaryCapillary
Active phase FFAPDB-FFAPDB-FFAPCP-Wax 58CBDB-FFAP
Column length (m)  30.30.25.30.
Carrier gas Helium HeHeliumHe
Substrate
Column diameter (mm)  0.320.320.320.32
Phase thickness (μm)  0.250.250.200.25
Program not specified40C(2min) => 40C/min => 60C(2min) => 6C/min => 180C => 15C/min => 230C(10min)40C(1min) => 7C/min => 180C => 10C/min => 240C (10min)40 0C (2 min) 40 0C/min -> 60 0C (1 min) 6 0C/min -> 180 0C 10 0C/min -> 240 0C (5 min)40C(2min) => 40C/min => 60C(2min) => 6C/min => 180C => 15C/min => 230C (10min)
I 2176.2190.2196.2165.2186.
ReferenceFrauendorfer and Schieberle, 2008Buettner, 2007Greger and Schieberle, 2007Tokitomo, Steihaus, et al., 2005Buettner, 2004
Comment MSDC-RI MSDC-RI MSDC-RI MSDC-RI MSDC-RI
Column type CapillaryCapillaryCapillaryCapillaryCapillary
Active phase Carbowax 20MDB-WaxCarbowax 20MFFAPFFAP
Column length (m)   50.50.30.
Carrier gas   Helium He
Substrate
Column diameter (mm)   0.700.20.32
Phase thickness (μm)    0.330.25
Program not specifiednot specifiednot specified60C(1min) => 2.5C/min => 115C => 1C/min => 210C(30min)35C (2min) => 40C/min => 60C (2min) => 6C/min => 180C => 10C/min => 240C
I 2144.2203.2178.2198.2208.
ReferenceVinogradov, 2004Peterson and Reineccius, 2003Saura, LAencina, et al., 2003Tucker, Maciarello, et al., 2001Schermann and Schieberle, 1997
Comment MSDC-RI MSDC-RI MSDC-RI MSDC-RI MSDC-RI

Van Den Dool and Kratz RI, polar column, temperature ramp

Data compiled by: NIST Mass Spectrometry Data Center, William E. Wallace, director

Column type CapillaryCapillaryCapillaryCapillaryCapillary
Active phase DB-Wax EtrFFAPDB-WaxDB-WaxFFAP
Column length (m) 30.30.30.30.30.
Carrier gas  HeHeHeHe
Substrate
Column diameter (mm) 0.250.250.250.250.32
Phase thickness (μm) 0.250.250.50.5
Tstart (C) 40.35.40.40.40.
Tend (C) 250.225.250.250.240.
Heat rate (K/min) 5.10.4.4.8.
Initial hold (min) 3.5.5.5.2.
Final hold (min) 15.25.15.15.5.
I 2192.2189.2190.2190.2225.
ReferenceAubert and Chanforan, 2007Lozano P.R., Miracle E.R., et al., 2007Pozo-Bayon M.A., Ruiz-Rodriguez A., et al., 2007Pozo-Bayon M.A., Ruiz-Rodriguez A., et al., 2007Schlutt B., Moran N., et al., 2007
Comment MSDC-RI MSDC-RI MSDC-RI MSDC-RI MSDC-RI
Column type CapillaryCapillaryCapillaryCapillaryCapillary
Active phase DB-Wax EtrDB-WaxDB-WaxDB-FFAPDB-Wax
Column length (m) 30.60.60.30.30.
Carrier gas HeH2H2N2
Substrate
Column diameter (mm) 0.250.250.250.250.25
Phase thickness (μm) 0.250.250.250.250.25
Tstart (C) 40.30.30.30.40.
Tend (C) 250.230.230.250.200.
Heat rate (K/min) 5.3.3.3.10.
Initial hold (min) 3.2.2.2.5.
Final hold (min) 15.4.4.2.15.
I 2195.2201.2201.2204.2179.
ReferenceAubert C. and Pitrat M., 2006Schwambach and Peterson, 2006Schwambach and Peterson, 2006Colahan-Sederstrom and Peterson, 2005Avsar, Karagul-Yuceer, et al., 2004
Comment MSDC-RI MSDC-RI MSDC-RI MSDC-RI MSDC-RI
Column type CapillaryCapillaryCapillaryCapillaryCapillary
Active phase DB-WaxDB-FFAPDB-WaxDB-WaxDB-Wax
Column length (m) 30.15.30.30.30.
Carrier gas  HeHe
Substrate
Column diameter (mm) 0.250.320.250.320.32
Phase thickness (μm) 0.250.250.50.50.5
Tstart (C) 40.35.40.40.40.
Tend (C) 200.225.230.245.245.
Heat rate (K/min) 10.10.5.3.2.
Initial hold (min) 5.5.2.3.3.
Final hold (min) 15.15.10.20.20.
I 2179.2190.2220.2193.2194.
ReferenceAvsar, Karagul-Yuceer, et al., 2004Avsar, Karagul-Yuceer, et al., 2004Mahajan, Goddik, et al., 2004Aubert, Ambid, et al., 2003Aubert, Günata, et al., 2003
Comment MSDC-RI MSDC-RI MSDC-RI MSDC-RI MSDC-RI
Column type CapillaryCapillaryCapillaryCapillaryCapillary
Active phase DB-WaxDB-FFAPDB-WaxDB-WaxDB-Wax
Column length (m) 30.30.30.30.30.
Carrier gas  He
Substrate
Column diameter (mm) 0.320.250.250.320.25
Phase thickness (μm) 0.50.250.250.50.25
Tstart (C) 40.35.35.40.35.
Tend (C) 245.200.240.240.200.
Heat rate (K/min) 2.10.6.7.10.
Initial hold (min) 3.5.2. 5.
Final hold (min) 20.30.6.5.30.
I 2194.2184.2203.2216.2190.
ReferenceAubert, Günata, et al., 2003Karagül-Yüceer, Vlahovich, et al., 2003Peterson and Reineccius, 2003Valim, Rouseff, et al., 2003Karagül-Yüceer, Cadwallader, et al., 2002
Comment MSDC-RI MSDC-RI MSDC-RI MSDC-RI MSDC-RI
Column type CapillaryCapillaryCapillaryCapillaryCapillary
Active phase DB-FFAPDB-WaxDB-WaxDB-WaxDB-Wax
Column length (m) 30.30.60.60.60.
Carrier gas   HeHeHe
Substrate
Column diameter (mm) 0.250.250.250.250.25
Phase thickness (μm) 0.250.250.250.25
Tstart (C) 35.35.50.50.40.
Tend (C) 200.200.230.230.200.
Heat rate (K/min) 10.10.2.2.3.
Initial hold (min) 5.5.  5.
Final hold (min) 30.30.60.60.
I 2173.2183.2229.2221.2210.
ReferenceKaragül-Yüceer, Cadwallader, et al., 2002Karagül-Yüceer, Drake, et al., 2001Shimoda, Yoshimura, et al., 2001Shiratsuchi, Shimoda, et al., 1994Sumitani, Suekane, et al., 1994
Comment MSDC-RI MSDC-RI MSDC-RI MSDC-RI MSDC-RI
Column type CapillaryCapillary
Active phase DB-WaxCP-Wax 58CB
Column length (m) 30.30.
Carrier gas HeHe
Substrate
Column diameter (mm) 0.250.25
Phase thickness (μm)  0.22
Tstart (C) 40.40.
Tend (C) 200.220.
Heat rate (K/min) 2.3.
Initial hold (min) 10.
Final hold (min)
I 2174.2144.
ReferenceUmano, Hagi, et al., 1992Pabst, Barron, et al., 1991
Comment MSDC-RI MSDC-RI

Phase change data

Data compiled by: William E. Acree, Jr., James S. Chickos

Quantity Value Units Method Reference Comment
Δvap17.7 ± 0.07kcal/molGSEmel'yanenko, Kozlova, et al., 2007Based on data from 309. - 358. K.
Δvap15.1 ± 0.36kcal/molMMWiberg and Waldron, 1991Based on data from 365. - 387. K.

Enthalpy of vaporization

ΔvapH (kcal/mol) Temperature (K) Method Reference Comment
13.8 ± 0.2376.MMWiberg and Waldron, 1991Based on data from 365. - 387. K.

References

Lozano P.R., Miracle E.R., et al., 2007
Lozano P.R.; Miracle E.R.; Krause A.J.; Drake M.; Cadwallader K.R., Effect of cold storage and packaging material on the major aroma components of sweet cream butter, J. Agric. Food Chem., 2007, 55, 19, 7840-7846, https://doi.org/10.1021/jf071075q . [all data]

Schlutt B., Moran N., et al., 2007
Schlutt B.; Moran N.; Schieberle P.; Hofmann T., Sensory-directed identification of creaminess-enhancing volatiles and semivolatiles in full-fat cream, J. Agric. Food Chem., 2007, 55, 23, 9634-9645, https://doi.org/10.1021/jf0721545 . [all data]

Perraudin, Popovici, et al., 2006
Perraudin, F.; Popovici, J.; Bertrand, C., Analysis of headspace-solid microextracts from flowers of Maxillaria tenuifolia Lindl. by GC-MS, Electronic Journal of Natural Substances, 2006, 1, 1-5. [all data]

Schwambach and Peterson, 2006
Schwambach, S.L.; Peterson, D.G., Reduction of Stale Flavor Development in Low-Heat Skim Milk Powder via Epicatechin Addition, J. Agric. Food Chem., 2006, 54, 2, 502-508, https://doi.org/10.1021/jf0519764 . [all data]

Carunchia Whetstine, Croissant, et al., 2005
Carunchia Whetstine, M.E.; Croissant, A.E.; Drake, M.A., Characterization of Dried Whey Protein Concentrate and Isolate Flavor, J. Dairy Sci., 2005, 88, 11, 3826-3839, https://doi.org/10.3168/jds.S0022-0302(05)73068-X . [all data]

Colahan-Sederstrom and Peterson, 2005
Colahan-Sederstrom, P.M.; Peterson, D.G., Inhibition of key aroma compound generated during ultrahigh-temperature processing of bovine milk via epicatechin addition, J. Agric. Food Chem., 2005, 53, 2, 398-402, https://doi.org/10.1021/jf0487248 . [all data]

Mahattanatawee, Goodner, et al., 2005
Mahattanatawee, K.; Goodner, K.L.; Baldwin, E.A., Volatile constituents and character impact compounds of selected Florida's tropical fruit, Proc. Fla. State Hort. Soc., 2005, 118, 414-418. [all data]

Pino, Mesa, et al., 2005
Pino, J.A.; Mesa, J.; Muñoz, Y.; Martí, M.P.; Marbot, R., Volatile components from mango (Mangifera indica L.) cultivars, J. Agric. Food Chem., 2005, 53, 6, 2213-2223, https://doi.org/10.1021/jf0402633 . [all data]

Whetstine, Cadwallader, et al., 2005
Whetstine, M.E.C.; Cadwallader, K.R.; Drake, M.A., Characterization of aroma compounds responsible for the rosy/floral flavor in cheddar cheese, J. Agric. Food Chem., 2005, 53, 8, 3126-3132, https://doi.org/10.1021/jf048278o . [all data]

Mahajan, Goddik, et al., 2004
Mahajan, S.S.; Goddik, L.; Qian, M.C., Aroma Compounds in Sweet Whey Powder, J. Dairy Sci., 2004, 87, 12, 4057-4063, https://doi.org/10.3168/jds.S0022-0302(04)73547-X . [all data]

Karagül-Yüceer, Vlahovich, et al., 2003
Karagül-Yüceer, Y.; Vlahovich, K.N.; Drake, M.A.; Cadwallader, K.R., Characteristic aroma components of rennet casein, J. Agric. Food Chem., 2003, 51, 23, 6797-6801, https://doi.org/10.1021/jf0345806 . [all data]

Peterson and Reineccius, 2003
Peterson, D.G.; Reineccius, G.A., Characterization of the volatile compounds that constitute fresh sweet cream butter aroma, Flavour Fragr. J., 2003, 18, 3, 215-220, https://doi.org/10.1002/ffj.1192 . [all data]

Peterson and Reineccius, 2003, 2
Peterson, D.G.; Reineccius, G.A., Determination of the aroma impact compounds in heated sweet cream butter, Flavour Fragr. J., 2003, 18, 4, 320-324, https://doi.org/10.1002/ffj.1228 . [all data]

Valim, Rouseff, et al., 2003
Valim, M.F.; Rouseff, R.L.; Lin, J., Gas chromatographic-olfactometric characterization of aroma compounds in two types of cashew apple nectar, J. Agric. Food Chem., 2003, 51, 4, 1010-1015, https://doi.org/10.1021/jf025738+ . [all data]

Karagül-Yüceer, Cadwallader, et al., 2002
Karagül-Yüceer, Y.; Cadwallader, K.R.; Drake, M.A., Volatile flavor components of stored nonfat dry milk, J. Agric. Food Chem., 2002, 50, 2, 305-312, https://doi.org/10.1021/jf010648a . [all data]

Karagül-Yüceer, Drake, et al., 2001
Karagül-Yüceer, Y.; Drake, M.; Cadwallader, K.R., Aroma-active components of nonfat dry milk, J. Agric. Food Chem., 2001, 49, 6, 2948-2953, https://doi.org/10.1021/jf0009854 . [all data]

Moio and Addeo, 1998
Moio, L.; Addeo, F., Grana Padano cheese aroma, J. Dairy Res., 1998, 65, 2, 317-333, https://doi.org/10.1017/S0022029997002768 . [all data]

Moio L., Rillo L., et al., 1996
Moio L.; Rillo L.; Ledda A.; Addeo F., Odorous constituents of ovine milk in relationship to diet, J. Dairy Sci., 1996, 79, 8, 1322-1331, https://doi.org/10.3168/jds.S0022-0302(96)76488-3 . [all data]

Gómez, Ledbetter, et al., 1993
Gómez, E.; Ledbetter, C.A.; Hartsell, P.L., Volatile compounds in apricot, plum, and their interspecific hybrids, J. Agric. Food Chem., 1993, 41, 10, 1669-1676, https://doi.org/10.1021/jf00034a029 . [all data]

de Frutos, Sanz, et al., 1991
de Frutos, M.; Sanz, J.; Martinez-Castro, I., Characterization of artisanal cheeses by GC and GC/MS analysis of their medium volatility (SDE) fraction, J. Agric. Food Chem., 1991, 39, 3, 524-530, https://doi.org/10.1021/jf00003a019 . [all data]

Guichard and Souty, 1988
Guichard, E.; Souty, M., Comparison of the relative quantities of aroma compounds found in fresh apricot (Prunus armeniaca) from six different varieties, Z. Lebensm. Unters. Forsch., 1988, 186, 4, 301-307, https://doi.org/10.1007/BF01027031 . [all data]