Diberyllium dioxide

Gas phase ion energetics data

Data compiled as indicated in comments:
RDSH - Henry M. Rosenstock, Keith Draxl, Bruce W. Steiner, and John T. Herron

Ionization energy determinations

IE (eV) Method Reference Comment
11.1 ± 0.4EITheard and Hildenbrand, 1964RDSH
10.5EIChupka, Berkowitz, et al., 1959RDSH

References

Theard and Hildenbrand, 1964
Theard, L.P.; Hildenbrand, D.L., Heat of formation of Be2O(g) by mass spectrometry, J. Chem. Phys., 1964, 41, 3416. [all data]

Chupka, Berkowitz, et al., 1959
Chupka, W.A.; Berkowitz, J.; Giese, C.F., Vaporization of beryllium oxide and its reaction with tungsten, J. Chem. Phys., 1959, 30, 827. [all data]