cis-2-(2-Pentenyl)furan

Van Den Dool and Kratz RI, non-polar column, temperature ramp

View large format table.

Column type Active phase I Reference Comment
CapillaryCP-Sil 8CB-MS1002.Elmore, Cooper, et al., 20050. m/0.25 mm/0.25 μm, He, 40. C @ 2. min, 4. K/min, 280. C @ 5. min
CapillaryCP Sil 8 CB1004.Elmore, Campo, et al., 200260. m/0.25 mm/0.25 μm, He, 40. C @ 2. min, 4. K/min; Tend: 280. C
CapillaryCP Sil 8 CB1002.Elmore, Mottram, et al., 200060. m/0.25 mm/0.25 μm, He, 40. C @ 2. min, 4. K/min; Tend: 280. C

Van Den Dool and Kratz RI, non-polar column, custom temperature program

View large format table.

Column type Active phase I Reference Comment
CapillaryCP-Sil 8CB-MS1003.Elmore, Mottram, et al., 2000, 260. m/0.25 mm/0.25 μm, He; Program: 0C(5min) => 40C/min => 40C (2min) => 4C/min => 280C

Normal alkane RI, non-polar column, custom temperature program

View large format table.

Column type Active phase I Reference Comment
CapillaryTR-5 MS1001.Kurashov, Mitrukova, et al., 201415. m/0.25 mm/0.25 μm, Helium; Program: 35 0C (3 min) 2 0C/min -> 60 0C (3 min) 2 0C/min -> 80 0C (3 min) 4 0C/min -> 120 0C (3 min) 5 0C/min -> 150 0C (3 min) 15 0C/min -> 240 0C (10 min)
CapillaryTR-5 MS1016.Kurashov, Krylova, et al., 201315. m/0.25 mm/0.25 μm, Helium; Program: 35 0C (3 min) 2 0C/min -> 60 0C (3 min) 2 0C/min -> 80 0C (3 min) 4 0C/min -> 120 0C (3 min) 5 0C/min -> 150 0C (3 mion) 15 0C/min -> 240 0C (10 min)

References

Elmore, Cooper, et al., 2005
Elmore, J.S.; Cooper, S.L.; Enser, M.; Mottram, D.S.; Sinclair, L.A.; Wilkinson, R.G.; Wood, J.D., Dietary manipulation of fatty acid composition in lamb meat and its effect on the volatile aroma compounds of grilled lamb, Meat Sci., 2005, 69, 2, 233-242, https://doi.org/10.1016/j.meatsci.2004.07.002 . [all data]

Elmore, Campo, et al., 2002
Elmore, J.S.; Campo, M.M.; Enser, M.; Mottram, D.S., Effect of lipid composition on meat-like model systems containing cysteine, ribose, and polyunsaturated fatty acids, J. Agric. Food Chem., 2002, 50, 5, 1126-1132, https://doi.org/10.1021/jf0108718 . [all data]

Elmore, Mottram, et al., 2000
Elmore, J.S.; Mottram, D.S.; Hierro, E., Two-fibre solid-phase microextraction combined with gas chromatography-mass spectrometry for the analysis of volatile aroma compounds in cooked pork, J. Chromatogr. A, 2000, 905, 1-2, 233-240, https://doi.org/10.1016/S0021-9673(00)00990-0 . [all data]

Elmore, Mottram, et al., 2000, 2
Elmore, J.S.; Mottram, D.S.; Enser, M.; Wood, J.D., The effects of diet and breed on the volatile compounds of cooked lamb, Meat Sci., 2000, 55, 2, 149-159, https://doi.org/10.1016/S0309-1740(99)00137-0 . [all data]

Kurashov, Mitrukova, et al., 2014
Kurashov, E.A.; Mitrukova, G.G.; Krylova, Yu.V., Variations in the component composition of essential oil of Ceratophyllum demersum (Ceratophyllaceae) during vegetation (in press), Plant Resources (Rastitel'nye Resursy), 2014, 1, 000-000. [all data]

Kurashov, Krylova, et al., 2013
Kurashov, E.A.; Krylova, Yu.V.; Mitrukova, G.G., Variations in component composition of essential oil of Potamogeton pusillus (Potamogetonaceae) dirong vegetation, Plant Resources (Rastitel'nye Resursy), 2013, 000-000. [all data]