16-Azatricyclo[9.2.2.14,8]hexadeca-4,6,8(16),11,13,14-hexaene,12,14-dimethyl-

Gas phase ion energetics data

Data compiled by: Sharon G. Lias, Rhoda D. Levin, and Sherif A. Kafafi

Ionization energy determinations

IE (eV) Method Reference Comment
7.70PEReingold, Schmidt, et al., 1979Vertical value

References

Reingold, Schmidt, et al., 1979
Reingold, I.D.; Schmidt, W.; Boekelheide, V., Syntheses, properties, and photoelectron spectra of substituted and layered [2.2]2,6pyridinoparacyclophanes, J. Am. Chem. Soc., 1979, 101, 2121. [all data]