2,3,6,7,10,11-Hexa-n-hexyloxytriphenylene

Phase change data

Data compiled by: Eugene S. Domalski and Elizabeth D. Hearing

Enthalpy of phase transition

ΔHtrs (kcal/mol) Temperature (K) Initial Phase Final Phase Reference Comment
0.2772105.90crystaline, VIcrystaline, VSorai, Asahina, et al., 1990
0.4661220.86crystaline, Vcrystaline, IVSorai, Asahina, et al., 1990
0.3107233.91crystaline, IVcrystaline, IIISorai, Asahina, et al., 1990
0.7314330.81crystaline, IIIcrystaline, IISorai, Asahina, et al., 1990
0.5999337.10crystaline, IIcrystaline, ISorai, Asahina, et al., 1990

Entropy of phase transition

ΔStrs (cal/mol*K) Temperature (K) Initial Phase Final Phase Reference Comment
3.210105.90crystaline, VIcrystaline, VSorai, Asahina, et al., 1990
1.33220.86crystaline, Vcrystaline, IVSorai, Asahina, et al., 1990
2.11233.91crystaline, IVcrystaline, IIISorai, Asahina, et al., 1990
2.29330.81crystaline, IIIcrystaline, IISorai, Asahina, et al., 1990
1.78337.10crystaline, IIcrystaline, ISorai, Asahina, et al., 1990

References

Sorai, Asahina, et al., 1990
Sorai, M.; Asahina, S.; Destrade, C., and Nguyen Huu Tinh, Heat capacity of the discotic mesogen, 2,3,6,7,10,11-hexa-n-hexyloxytriphenylene, between 17 and 397K and phase transitions in the solid and liquid states, Liq. Cryst., 1990, 7(2), 163-180. [all data]