Polystyrene-polystyrene-d8 copolymer

Condensed phase thermochemistry data

Data compiled by: Eugene S. Domalski and Elizabeth D. Hearing

Quantity Value Units Method Reference Comment
solid,1 bar69.65cal/mol*KN/ALebedev, Smirnova, et al., 1983glass phase

Constant pressure heat capacity of solid

Cp,solid (cal/mol*K) Temperature (K) Reference Comment
66.71298.15Lebedev, Smirnova, et al., 1983glass phase; T = 7 to 330 K.

References

Lebedev, Smirnova, et al., 1983
Lebedev, B.V.; Smirnova, N.N.; Lebedev, N.K.; Kozyreva, N.M.; Kirilin, A.I.; Korshak, V.V., Effect of replacing hydrogen by deuterium and the associated difference on chain links on the thermodynamic properties of polystyrene over the range 0-350°K, Dokl. Akad. Nauk, 1983, SSSR 270, 129-132. [all data]