Hexestrol, 2TMS derivative

Normal alkane RI, non-polar column, temperature ramp

Data compiled by: NIST Mass Spectrometry Data Center, William E. Wallace, director

Column type Capillary
Active phase HP-5
Column length (m) 30.
Carrier gas He
Substrate
Column diameter (mm) 0.25
Phase thickness (μm) 0.25
Tstart (C) 50.
Tend (C) 300.
Heat rate (K/min) 5.
Initial hold (min)
Final hold (min)
I 1846.
ReferenceIsidorov, Olchowik, et al., 2007
Comment MSDC-RI

Kovats' RI, non-polar column, isothermal

View large format table.

Column type Active phase Temperature (C) I Reference Comment
PackedOV-1160.1844.Petersson, 1977N2, Chromosorb G (100-120 mesh); Column length: 2. m

Van Den Dool and Kratz RI, non-polar column, temperature ramp

View large format table.

Column type Active phase I Reference Comment
CapillaryDB-51842.Jaroszynska and Ligor, 200530. m/0.25 mm/0.25 μm, He, 3. K/min; Tstart: 50. C; Tend: 320. C
CapillaryDB-51849.Jaroszynska and Ligor, 200530. m/0.25 mm/0.25 μm, He, 3. K/min; Tstart: 50. C; Tend: 320. C
CapillaryDB-51849.Jaroszynska and Ligor, 200530. m/0.25 mm/0.25 μm, He, 3. K/min; Tstart: 50. C; Tend: 320. C
CapillaryDB-51849.Jaroszynska and Ligor, 200530. m/0.25 mm/0.25 μm, He, 3. K/min; Tstart: 50. C; Tend: 320. C
CapillaryPE-5ht1860.Jaroszynska and Ligor, 200530. m/0.25 mm/0.1 μm, He, 3. K/min; Tstart: 50. C; Tend: 320. C
CapillaryPE-5ht1864.Jaroszynska and Ligor, 200530. m/0.25 mm/0.1 μm, He, 3. K/min; Tstart: 50. C; Tend: 320. C
CapillaryPE-5ht1865.Jaroszynska and Ligor, 200530. m/0.25 mm/0.1 μm, He, 3. K/min; Tstart: 50. C; Tend: 320. C
CapillaryPE-5ht1865.Jaroszynska and Ligor, 200530. m/0.25 mm/0.1 μm, He, 3. K/min; Tstart: 50. C; Tend: 320. C
CapillaryPE-5ms1825.Jaroszynska and Ligor, 200530. m/0.25 mm/0.25 μm, He, 3. K/min; Tstart: 50. C; Tend: 320. C
CapillaryPE-5ms1825.Jaroszynska and Ligor, 200530. m/0.25 mm/0.25 μm, He, 3. K/min; Tstart: 50. C; Tend: 320. C
CapillaryDB-51839.Jaroszynska, 200330. m/0.25 mm/0.25 μm, He, 3. K/min; Tstart: 50. C; Tend: 240. C
CapillaryDB-51849.Jaroszynska, 200330. m/0.25 mm/0.25 μm, He, 3. K/min; Tstart: 50. C; Tend: 240. C
CapillaryDB-51826.Jaroszynska, 200330. m/0.25 mm/0.25 μm, He, 7. K/min; Tstart: 50. C; Tend: 240. C
CapillaryDB-51836.Jaroszynska, 200330. m/0.25 mm/0.25 μm, He, 7. K/min; Tstart: 50. C; Tend: 240. C

References

Isidorov, Olchowik, et al., 2007
Isidorov, V.A.; Olchowik, E.; Vinogorova, V.T., Simplified extraction procedure and gas chromatographic determination of acid compounds in plant material, Chemia Analityczna, 2007, 52, 3, 423-433. [all data]