5-Nitro-2-furamide

Condensed phase thermochemistry data

Data compiled by: Hussein Y. Afeefy, Joel F. Liebman, and Stephen E. Stein

Quantity Value Units Method Reference Comment
Δfsolid-77.2 ± 0.1kcal/molCcbBalepin, Lebedev, et al., 1980%hf298 calculated possible error by the author
Quantity Value Units Method Reference Comment
Δcsolid-529.7 ± 0.1kcal/molCcbBalepin, Lebedev, et al., 1980%hf298 calculated possible error by the author

References

Balepin, Lebedev, et al., 1980
Balepin, A.A.; Lebedev, V.P.; Kuznetsova, A.A.; Venter, K.K.; Trushule, M.A.; Lolya, D.O.; Lebedev, Yu.A., Thermochemical properties of α-nitro derivatives of furan, Bull. Acad. Sci. USSR, Div. Chem. Sci., 1980, 601-604. [all data]