Ethanone, 2-bromo-1-phenyl-

Phase change data

Data compiled as indicated in comments:
BS - Robert L. Brown and Stephen E. Stein
TRC - Thermodynamics Research Center, NIST Boulder Laboratories, Chris Muzny director

Quantity Value Units Method Reference Comment
Tfus324.KN/ABuckingham and Donaghy, 1982BS
Tfus324.KN/AHeydtmann, Schmidt, et al., 1966Uncertainty assigned by TRC = 1. K; TRC

Reduced pressure boiling point

Tboil (K) Pressure (bar) Reference Comment
408.20.024Weast and Grasselli, 1989BS
408.0.024Buckingham and Donaghy, 1982BS

In addition to the Thermodynamics Research Center (TRC) data available from this site, much more physical and chemical property data is available from the following TRC products:

Gas phase ion energetics data

Data compiled as indicated in comments:
LBLHLM - Sharon G. Lias, John E. Bartmess, Joel F. Liebman, John L. Holmes, Rhoda D. Levin, and W. Gary Mallard
LLK - Sharon G. Lias, Rhoda D. Levin, and Sherif A. Kafafi

Ionization energy determinations

IE (eV) Method Reference Comment
9.6PEDistefano, Granozzi, et al., 1987Vertical value; LBLHLM

Appearance energy determinations

Ion AE (eV) Other Products MethodReferenceComment
C7H5O+9.67CH2BrPIMcLoughlin and Traeger, 1979LLK

References

Buckingham and Donaghy, 1982
Buckingham, J.; Donaghy, S.M., Dictionary of Organic Compounds: Fifth Edition, Chapman and Hall, New York, 1982, 1. [all data]

Heydtmann, Schmidt, et al., 1966
Heydtmann, V.H.; Schmidt, A.P.; Hartmann, H., The temperature, hydrostatic pressure and solvent dependence of the Menschutkin reaction of w-bromoacetophenone with d-picoline., Ber. Bunsen-Ges. Phys. Chem., 1966, 70, 444. [all data]

Weast and Grasselli, 1989
CRC Handbook of Data on Organic Compounds, 2nd Editon, Weast,R.C and Grasselli, J.G., ed(s)., CRC Press, Inc., Boca Raton, FL, 1989, 1. [all data]

Distefano, Granozzi, et al., 1987
Distefano, G.; Granozzi, G.; Olivato, P.R.; Guerrero, S.A., Hyperconjugative interactions in halogen-substituted carbonyls: Ultraviolet photoelectron spectroscopy of w-halogenoacetophenones, J. Chem. Soc. Perkin Trans. 2, 1987, 1459. [all data]

McLoughlin and Traeger, 1979
McLoughlin, R.G.; Traeger, J.C., A photoionization study of some benzoyl compounds - thermochemistry of [C7H5O]+ formation, Org. Mass Spectrom., 1979, 14, 434. [all data]