2-Methyladamantane

Gas phase thermochemistry data

Data compiled by: Hussein Y. Afeefy, Joel F. Liebman, and Stephen E. Stein

Quantity Value Units Method Reference Comment
Δfgas-152.0 ± 4.4kJ/molCcbClark, Knox, et al., 1979Reanalyzed by Pedley, Naylor, et al., 1986, Original value = -149.2 ± 2.6 kJ/mol; Gas flow technique for Hs, see Clark, Knox, et al., 1975
Δfgas-151.4 ± 4.0kJ/molCcbSteele and Watt, 1977Reanalyzed by Pedley, Naylor, et al., 1986, Original value = -156. ± 2. kJ/mol

Condensed phase thermochemistry data

Data compiled by: Hussein Y. Afeefy, Joel F. Liebman, and Stephen E. Stein

Quantity Value Units Method Reference Comment
Δfsolid-216.7 ± 1.2kJ/molCcbClark, Knox, et al., 1979Gas flow technique for Hs, see Clark, Knox, et al., 1975
Δfsolid-225. ± 2.kJ/molCcbSteele and Watt, 1977
Quantity Value Units Method Reference Comment
Δcsolid-6684.4 ± 1.2kJ/molCcbClark, Knox, et al., 1979Gas flow technique for Hs, see Clark, Knox, et al., 1975; Corresponding Δfsolid = -216.7 kJ/mol (simple calculation by NIST; no Washburn corrections)
Δcsolid-6676. ± 2.kJ/molCcbSteele and Watt, 1977Corresponding Δfsolid = -225. kJ/mol (simple calculation by NIST; no Washburn corrections)

Reaction thermochemistry data

Data compiled by: Hussein Y. Afeefy, Joel F. Liebman, and Stephen E. Stein

Individual Reactions

2-Methyladamantane = 1-Methyladamantane

By formula: C11H18 = C11H18

Quantity Value Units Method Reference Comment
Δr-14.1 ± 0.46kJ/molEqkEngler, Blanchard, et al., 1972liquid phase; GLC

Kovats' RI, non-polar column, isothermal

View large format table.

Column type Active phase Temperature (C) I Reference Comment
PackedSE-30150.1200.Yashkin, Kurbatova, et al., 2001CHromaton N-AW; Column length: 1. m
CapillarySqualane110.1176.2Bender, Said, et al., 1986He; Column length: 100. m; Column diameter: 0.25 mm
CapillarySE-30110.1166.Bogoslovsky, Anvaer, et al., 1978
CapillarySE-30120.1175.Bogoslovsky, Anvaer, et al., 1978
CapillarySE-30130.1182.Bogoslovsky, Anvaer, et al., 1978
CapillarySE-30140.1192.Bogoslovsky, Anvaer, et al., 1978
CapillarySE-30145.1192.Bogoslovsky, Anvaer, et al., 1978
CapillarySE-30150.1200.Bogoslovsky, Anvaer, et al., 1978
CapillarySqualane100.1168.Bogoslovsky, Anvaer, et al., 1978
CapillarySqualane110.1175.Bogoslovsky, Anvaer, et al., 1978
CapillarySqualane125.1182.Bogoslovsky, Anvaer, et al., 1978
CapillarySqualane140.1192.Bogoslovsky, Anvaer, et al., 1978
PackedSE-30120.1175.Mitra, Mohan, et al., 1974N2, Chrom W; Column length: 6.1 m
PackedSE-30130.1182.Mitra, Mohan, et al., 1974N2, Chrom W; Column length: 6.1 m
CapillarySE-30130.1187.Mitra, Mohan, et al., 1974, 2H2; Column length: 6.1 m; Column diameter: 3.18 mm
CapillarySE-30140.1192.Mitra, Mohan, et al., 1974, 2H2; Column length: 6.1 m; Column diameter: 3.18 mm
CapillarySE-30150.1200.Mitra, Mohan, et al., 1974, 2H2; Column length: 6.1 m; Column diameter: 3.18 mm
CapillarySqualane100.1162.Mitra, Mohan, et al., 1974, 2H2; Column length: 50. m; Column diameter: 0.2 mm
CapillarySqualane100.1168.Mitra, Mohan, et al., 1974, 2H2; Column length: 50. m; Column diameter: 0.2 mm
CapillarySqualane110.1175.Hála, Eyem, et al., 1970N2; Column length: 50. m; Column diameter: 0.2 mm
CapillarySqualane125.1182.Hála, Eyem, et al., 1970N2; Column length: 50. m; Column diameter: 0.2 mm
CapillarySqualane140.1192.Hála, Eyem, et al., 1970N2; Column length: 50. m; Column diameter: 0.2 mm
CapillarySE-30145.1196.Burkhard, Vais, et al., 1969N2; Column length: 50. m; Column diameter: 0.27 mm
CapillarySE-30160.1209.Burkhard, Vais, et al., 1969N2; Column length: 50. m; Column diameter: 0.27 mm

Kovats' RI, non-polar column, temperature ramp

View large format table.

Column type Active phase I Reference Comment
CapillaryHP-5MS1168.Yang, Wang, et al., 200630. m/0.25 mm/0.25 μm, 50. C @ 2. min, 6. K/min; Tend: 300. C

Kovats' RI, polar column, isothermal

View large format table.

Column type Active phase Temperature (C) I Reference Comment
PackedCarbowax 20M150.1407.Yashkin, Kurbatova, et al., 2001Column length: 1. m
CapillaryCarbowax 20M145.1400.Burkhard, Vais, et al., 1969N2; Column length: 50. m; Column diameter: 0.27 mm
CapillaryCarbowax 20M160.1420.Burkhard, Vais, et al., 1969N2; Column length: 50. m; Column diameter: 0.27 mm
CapillaryCarbowax 20M175.1442.Burkhard, Vais, et al., 1969N2; Column length: 50. m; Column diameter: 0.27 mm

Normal alkane RI, non-polar column, custom temperature program

View large format table.

Column type Active phase I Reference Comment
CapillaryPolydimethyl siloxane1196.Bayat and Abad, 2011Program: not specified
CapillaryPolydimethyl siloxane1196.Bayat and Abad M.F.Y., 2011Program: not specified

Phase change data

Data compiled as indicated in comments:
TRC - Thermodynamics Research Center, NIST Boulder Laboratories, Chris Muzny director
ALS - Hussein Y. Afeefy, Joel F. Liebman, and Stephen E. Stein
DRB - Donald R. Burgess, Jr.
AC - William E. Acree, Jr., James S. Chickos

Quantity Value Units Method Reference Comment
Tfus414.0KN/AClark, Knox, et al., 1977Crystal phase 1 phase; Uncertainty assigned by TRC = 0.5 K; sealed tube melting point; compound too volatile to perform calorimetric run on fusion.; TRC
Quantity Value Units Method Reference Comment
Δsub16.14kcal/molVClark, Knox, et al., 1979Gas flow technique for Hs, see Clark, Knox, et al., 1975; ALS
Δsub15.5kcal/molN/AClark, Knox, et al., 1979DRB
Δsub16.3 ± 0.3kcal/molVSteele and Watt, 1977ALS
Δsub17.6kcal/molN/ASteele and Watt, 1977DRB
Δsub16.3 ± 0.31kcal/molN/ASteele and Watt, 1977Based on data from 300. - 340. K.; AC

Enthalpy of sublimation

ΔsubH (kcal/mol) Temperature (K) Reference Comment
16.1 ± 0.50320.Clark, Knox, et al., 1975, 2Based on data from 310. - 330. K.; AC

In addition to the Thermodynamics Research Center (TRC) data available from this site, much more physical and chemical property data is available from the following TRC products:

References

Clark, Knox, et al., 1979
Clark, T.; Knox, T.M.O.; McKervey, M.A.; Mackle, H.; Rooney, J.J., Thermochemistry of bridged-ring substances. Enthalpies of formation of some diamondoid hydrocarbons and of perhydroquinacene. Comparisons with data from empirical force field calculations, J. Am. Chem. Soc., 1979, 101, 2404-2410. [all data]

Pedley, Naylor, et al., 1986
Pedley, J.B.; Naylor, R.D.; Kirby, S.P., Thermochemical Data of Organic Compounds, Chapman and Hall, New York, 1986, 1-792. [all data]

Clark, Knox, et al., 1975
Clark, T.; Knox, T.M.; Mackle, H.; McKervey, M.A.; Rooney, J.J., Calorimetric evaluation of enthalpies of formation of some bridged-ring hydrocarbons. Comparison with data from empirical force field calculations., J. Am. Chem. Soc., 1975, 97, 3835-3836. [all data]

Steele and Watt, 1977
Steele, W.V.; Watt, I., The standard enthalpies of formation of adamantanoid compounds 4. Methyladamantanes, J. Chem. Thermodyn., 1977, 9, 843-849. [all data]

Engler, Blanchard, et al., 1972
Engler, E.M.; Blanchard, K.R.; Schleyer, P.v.R., Enhanced axial-equatorial enthalpy differences in the methyl adamantanes, J. Chem. Soc. Chem. Commun., 1972, 1210-1212. [all data]