1,4-Benzenediol, 2,3,5-trimethyl-

Condensed phase thermochemistry data

Data compiled by: Eugene S. Domalski and Elizabeth D. Hearing

Constant pressure heat capacity of liquid

Cp,liquid (cal/mol*K) Temperature (K) Reference Comment
52.01313.65Baglay, Gurariy, et al., 1988T = 270 to 340 K. Unsmoothed experimental datum.

Phase change data

Data compiled as indicated in comments:
TRC - Thermodynamics Research Center, NIST Boulder Laboratories, Chris Muzny director
AC - William E. Acree, Jr., James S. Chickos

Quantity Value Units Method Reference Comment
Tfus443.15KN/ABaglai, Gurarii, et al., 1988Uncertainty assigned by TRC = 0.7 K; TRC

Enthalpy of vaporization

ΔvapH (kcal/mol) Temperature (K) Reference Comment
10.9 ± 0.07475.Baglay, Gurariy, et al., 1988Based on data from 450. - 501. K.; AC

In addition to the Thermodynamics Research Center (TRC) data available from this site, much more physical and chemical property data is available from the following TRC products:

References

Baglay, Gurariy, et al., 1988
Baglay, A.K.; Gurariy, L.L.; Kuleshov, G.G., Physical properties of compounds used in vitamin synthesis, J. Chem. Eng. Data, 1988, 33, 512-518. [all data]

Baglai, Gurarii, et al., 1988
Baglai, A.K.; Gurarii, L.L.; Kuleshov, G.G., Physical Properties of Compounds Used in Vitamin Synthesis, J. Chem. Eng. Data, 1988, 33, 512. [all data]