Benzonitrile, 4-[2-(methylsulfonyl)ethenyl]-

Gas phase ion energetics data

Data compiled as indicated in comments:
LBLHLM - Sharon G. Lias, John E. Bartmess, Joel F. Liebman, John L. Holmes, Rhoda D. Levin, and W. Gary Mallard

Ionization energy determinations

IE (eV) Method Reference Comment
9.0PECauletti, Furlani, et al., 1984LBLHLM
9.47PECauletti, Furlani, et al., 1984Vertical value; LBLHLM

References

Cauletti, Furlani, et al., 1984
Cauletti, C.; Furlani, C.; Nicotra, G.; Schleinitz, K.-D.; Wegener, W., Substituent effects on the electronic structure of some styryl methyl sulphones studied by ultraviolet photoelectron spectroscopy, J. Chem. Soc. Perkin Trans. 2, 1984, 533. [all data]