Uric acid

Condensed phase thermochemistry data

Data compiled as indicated in comments:
ALS - Hussein Y. Afeefy, Joel F. Liebman, and Stephen E. Stein
DH - Eugene S. Domalski and Elizabeth D. Hearing

Quantity Value Units Method Reference Comment
Δfsolid-618.81 ± 0.88kJ/molCcbStiehler and Huffman, 1935Reanalyzed by Cox and Pilcher, 1970, Original value = -623.33 kJ/mol; ALS
Quantity Value Units Method Reference Comment
Δcsolid-1920.4 ± 0.84kJ/molCcbStiehler and Huffman, 1935Reanalyzed by Cox and Pilcher, 1970, Original value = -1919.8 ± 0.84 kJ/mol; ALS
Δcsolid-1924.5kJ/molCcbEmery and Benedict, 1911ALS
Quantity Value Units Method Reference Comment
solid,1 bar173.2J/mol*KN/AStiehler and Huffman, 1935, 2Extrapolation below 90 K, 50.25 J/mol*K.; DH

Constant pressure heat capacity of solid

Cp,solid (J/mol*K) Temperature (K) Reference Comment
166.15297.1Stiehler and Huffman, 1935, 2T = 85 to 297 K. Value is unsmoothed experimental datum.; DH

References

Stiehler and Huffman, 1935
Stiehler, R.D.; Huffman, H.M., Thermal data. IV. The heats of combustion of adenine, hypoxanthine, guanine, xanthine, uric acid, allantoin and alloxan, J. Am. Chem. Soc., 1935, 57, 1734-1740. [all data]

Cox and Pilcher, 1970
Cox, J.D.; Pilcher, G., Thermochemistry of Organic and Organometallic Compounds, Academic Press, New York, 1970, 1-636. [all data]

Emery and Benedict, 1911
Emery, A.G.; Benedict, F.G., The heat of combustion of compounds of physiological importance, Am. J. Physiol., 1911, 28, 301-307. [all data]

Stiehler and Huffman, 1935, 2
Stiehler, R.D.; Huffman, H.M., Thermal data. V. The heat capacities, entropies and free energies of adenine, hypoxanthine, guanine, xanthine, uric acid, allantoin and alloxan, J. Am. Chem. Soc., 1935, 57, 1741-1743. [all data]