DL-2,3-Butanediol

Normal alkane RI, polar column, custom temperature program

Data compiled by: NIST Mass Spectrometry Data Center, William E. Wallace, director

Column type Capillary
Active phase DB-Wax
Column length (m) 30.
Carrier gas Helium
Substrate
Column diameter (mm) 0.32
Phase thickness (μm) 0.25
Program 40 0C (3 min) 4 0C/min -> 160 0C 7 0C/min -> 220 0C (8 min)
I 1620.
ReferenceLi, Tao, et al., 2008
Comment MSDC-RI

References

Li, Tao, et al., 2008
Li, H.; Tao, Y.-S.; Wang, H.; Zhang, L., Impact odorants of Chardonnay dry white wine from Changli Counti (China), Eur. Food. Res. Technol., 2008, 227, 1, 287-292, https://doi.org/10.1007/s00217-007-0722-9 . [all data]