2(5H)-Furanone, 5-ethyl-3-hydroxy-4-methyl-

Van Den Dool and Kratz RI, polar column, custom temperature program

Data compiled by: NIST Mass Spectrometry Data Center, William E. Wallace, director

Column type CapillaryCapillaryCapillaryCapillaryCapillary
Active phase StabilwaxStabilwaxFFAPFFAPFFAP
Column length (m) 30.30.30.30.30.
Carrier gas HeHeHeHeHe
Substrate
Column diameter (mm) 0.320.320.250.320.32
Phase thickness (μm) 1.1.0.250.250.25
Program 40C (2min) => 5C/min => 100C => 4C/min => 230C (10min)40C(2min) => 5C/min => 100C => 4C/min => 230C(10min)40C(1min) => 40C/min => 50C(2min) => 6C/min => 240C35C (2min) => 60C/min => 50C (2min) => 6C/min => 240C (10min)35C (2min) => 60C/min => 50C (2min) => 6C/min => 240C (10min)
I 2244.2246.2263.2267.2267.
ReferenceKlesk, Qian, et al., 2004Klesk and Qian, 2003Jezussek, Juliano, et al., 2002Kirchhoff and Schieberle, 2002Kirchhoff and Schieberle, 2002
Comment MSDC-RI MSDC-RI MSDC-RI MSDC-RI MSDC-RI
Column type Capillary
Active phase FFAP
Column length (m) 25.
Carrier gas He
Substrate
Column diameter (mm) 0.32
Phase thickness (μm) 0.5
Program 35C (2min) => 40C/min => 60C => 6C/min => 230C (10min)
I 2260.
ReferenceFickert and Schieberle, 1998
Comment MSDC-RI

Van Den Dool and Kratz RI, non-polar column, custom temperature program

View large format table.

Column type Active phase I Reference Comment
CapillaryDB-51217.Klesk, Qian, et al., 200430. m/0.32 mm/1. μm, He; Program: 40C (2min) => 5C/min => 100C => 4C/min => 230C (10min)
CapillaryDB-51227.Jezussek, Juliano, et al., 200230. m/0.32 mm/0.25 μm, He; Program: 40C(1min) => 40C/min => 50C(2min) => 6C/min => 240C
CapillarySE-541192.Fickert and Schieberle, 199825. m/0.32 mm/0.5 μm, He; Program: 35C (2min) => 4C/min => 150C => 10C/min => 240C

Normal alkane RI, non-polar column, temperature ramp

View large format table.

Column type Active phase I Reference Comment
Capillary5 % Phenyl methyl siloxane1180.Zellner, Bicchi, et al., 200830. m/0.25 mm/0.25 μm, 3. K/min; Tstart: 50. C; Tend: 250. C
CapillaryDB-51196.Fadel, Mageed, et al., 2006He, 60. C @ 5. min, 4. K/min; Column length: 60. m; Column diameter: 0.32 mm; Tend: 250. C
CapillaryDB-51196.Sanz, Czerny, et al., 200230. m/0.32 mm/0.25 μm, He, 40. C @ 2. min, 6. K/min, 230. C @ 5. min
CapillaryOV-1011156.Deibler, Acree, et al., 199810. m/0.25 mm/0.52 μm, Helium, 35. C @ 3. min, 6. K/min; Tend: 225. C

Normal alkane RI, non-polar column, custom temperature program

View large format table.

Column type Active phase I Reference Comment
CapillaryCP-Sil 5 CB1150.Collin, Nizet, et al., 201250. m/0.32 mm/1.20 μm, Nitrogen; Program: 36 0C 20 0C/min -> 85 0C 1 0C/min -> 145 0C 3 0C/min -> 250 0C
CapillaryCP-Sil 5 CB1150.Bailly, Jerkovic, et al., 200950. m/0.32 mm/1.20 μm, Nitrogen; Program: 36 0C 20 0C/min -> 85 0C 1 0C -> 145 0C 3 0C/min -> 250 0C
CapillarySE-541198.Buettner, 200430. m/0.32 mm/0.25 μm, He; Program: 40C(2min) => 40C/min => 50C(2min) => 6C/min => 180C => 15C/min => 230C (10min)
CapillarySE-541198.Schermann and Schieberle, 199730. m/0.32 mm/0.25 μm, He; Program: 35C (2min) => 40C/min => 60C (2min) => 6C/min => 180C => 10C/min => 240C
CapillarySE-541193.Blank, Sen, et al., 1992Program: not specified

Normal alkane RI, polar column, temperature ramp

View large format table.

Column type Active phase I Reference Comment
CapillaryDB-FFAP2260.Sanz, Czerny, et al., 200230. m/0.32 mm/0.25 μm, He, 40. C @ 2. min, 6. K/min, 230. C @ 5. min

Normal alkane RI, polar column, custom temperature program

View large format table.

Column type Active phase I Reference Comment
CapillaryFFAP-CB2304.Collin, Nizet, et al., 201225. m/0.32 mm/0.30 μm, Nitrogen; Program: 36 0C 20 0C/min -> 85 0C 1 0C/min -> 145 0C 3 0C/min -> 220 0C
CapillaryFFAP2304.Bailly, Jerkovic, et al., 200925. m/0.32 mm/0.30 μm, Nitrogen; Program: 36 0C 20 0C/min -> 85 0C 1 0C -> 145 0C 3 0C/min -> 230 0C
CapillaryDB-FFAP2247.Buettner, 200430. m/0.32 mm/0.25 μm, He; Program: 40C(2min) => 40C/min => 60C(2min) => 6C/min => 180C => 15C/min => 230C (10min)
CapillaryFFAP2250.Schermann and Schieberle, 199730. m/0.32 mm/0.25 μm, He; Program: 35C (2min) => 40C/min => 60C (2min) => 6C/min => 180C => 10C/min => 240C
CapillaryFFAP2250.Schermann and Schieberle, 199730. m/0.32 mm/0.25 μm, He; Program: 35C (2min) => 40C/min => 60C (2min) => 6C/min => 180C => 10C/min => 240C
CapillaryFFAP2270.Blank, Sen, et al., 1992Program: not specified

References

Klesk, Qian, et al., 2004
Klesk, K.; Qian, M.; Martin, R.R., Aroma extract dilution analysis of cv. meeker (Rubus idaeus L.) red raspberries from Oregon and Washington, J. Agric. Food Chem., 2004, 52, 16, 5155-5161, https://doi.org/10.1021/jf0498721 . [all data]

Klesk and Qian, 2003
Klesk, K.; Qian, M., Aroma extract dilution analysis of Cv. Marion (Rubus spp. hyb) and Cv. Evergreen (R. Iaciniatus L.) blackberries, J. Agric. Food Chem., 2003, 51, 11, 3436-3441, https://doi.org/10.1021/jf0262209 . [all data]

Jezussek, Juliano, et al., 2002
Jezussek, M.; Juliano, B.O.; Schieberle, P., Comparison of key aroma compounds in cooked brown rice varieties based on aroma extract dilution analysis, J. Agric. Food Chem., 2002, 50, 5, 1101-1105, https://doi.org/10.1021/jf0108720 . [all data]

Kirchhoff and Schieberle, 2002
Kirchhoff, E.; Schieberle, P., Quantitation of odor-active compounds in rye flour and rye sourdough using stable isotope dilution assays, J. Agric. Food Chem., 2002, 50, 19, 5378-5385, https://doi.org/10.1021/jf020236h . [all data]

Fickert and Schieberle, 1998
Fickert, B.; Schieberle, P., Identification of the key odorants in barley malt (caramalt) using GC/MS techniques and odour dilution analyses, Nahrung, 1998, 42, 6, 371-375, https://doi.org/10.1002/(SICI)1521-3803(199812)42:06<371::AID-FOOD371>3.0.CO;2-V . [all data]