2,5-Cyclohexadiene-1,4-dione, 2,6-dichloro-

Condensed phase thermochemistry data

Data compiled by: Hussein Y. Afeefy, Joel F. Liebman, and Stephen E. Stein

Quantity Value Units Method Reference Comment
Δfsolid-254.kJ/molCcbSjostrom, 1936At 318 K
Quantity Value Units Method Reference Comment
Δcsolid-2449.7 ± 8.4kJ/molCcbSmith, Bjellerup, et al., 1953Reanalyzed by Cox and Pilcher, 1970, Original value = -2451.7 ± 5.0 kJ/mol
Δcsolid-2444.kJ/molCcbSjostrom, 1936At 318 K
Δcsolid-2422.kJ/molCcbSwietoslawski and Starczedska, 1925

Phase change data

Data compiled as indicated in comments:
ALS - Hussein Y. Afeefy, Joel F. Liebman, and Stephen E. Stein
AC - William E. Acree, Jr., James S. Chickos

Quantity Value Units Method Reference Comment
Δsub69.9 ± 8.4kJ/molVCoolidge and Coolidge, 1927Reanalyzed by Pedley, Naylor, et al., 1986, Original value = 69.873 kJ/mol; ALS

Enthalpy of sublimation

ΔsubH (kJ/mol) Temperature (K) Method Reference Comment
69.9 ± 8.3274. - 315.QFCoolidge and Coolidge, 1927See also Jones, 1960 and Cox and Pilcher, 1970, 2.; AC

Gas phase ion energetics data

Data compiled by: John E. Bartmess

Electron affinity determinations

EA (eV) Method Reference Comment
2.480 ± 0.061IMREHeinis, Chowdhury, et al., 1988ΔGea=-55.8 kcal/mol; ΔSea estimated = -3.5 eu
2.485 ± 0.048IMREFukuda and McIver, 1985ΔGea(355 K) = -56.1 kcal/mol; ΔSea =-3.5, est. from data in Heinis, Chowdhury, et al., 1988

References

Sjostrom, 1936
Sjostrom, Av.G., De klorsubstituerade kinonernas och hydrokinonernas termokemi, Svensk. Kim. Tidr., 1936, 48, 121-124. [all data]

Smith, Bjellerup, et al., 1953
Smith, L.; Bjellerup, L.; Krook, S.; Westermark, H., Heats of combustion of organic chloro compounds determined by the "quartz wool" method, Acta Chem. Scand., 1953, 7, 65. [all data]

Cox and Pilcher, 1970
Cox, J.D.; Pilcher, G., Thermochemistry of Organic and Organometallic Compounds, Academic Press, New York, 1970, 1-636. [all data]

Swietoslawski and Starczedska, 1925
Swietoslawski, W.; Starczedska, H., Correction des donnees thermochimiques de M.A. Valeur, J. Chem. Phys., 1925, 22, 399-401. [all data]

Coolidge and Coolidge, 1927
Coolidge, A.S.; Coolidge, M.S., The sublimation pressures of substituted quinones and hydroquinones, J. Am. Chem. Soc., 1927, 49, 100-104. [all data]

Pedley, Naylor, et al., 1986
Pedley, J.B.; Naylor, R.D.; Kirby, S.P., Thermochemical Data of Organic Compounds, Chapman and Hall, New York, 1986, 1-792. [all data]

Jones, 1960
Jones, A.H., Sublimation Pressure Data for Organic Compounds., J. Chem. Eng. Data, 1960, 5, 2, 196-200, https://doi.org/10.1021/je60006a019 . [all data]

Cox and Pilcher, 1970, 2
Cox, J.D.; Pilcher, G., Thermochemistry of Organic and Organometallic Compounds, Academic Press Inc., London, 1970, 643. [all data]