Dihydromethyleugenol

Normal alkane RI, non-polar column, temperature ramp

View large format table.

Column type Active phase I Reference Comment
CapillaryHP-51515.Zhannan, Shiqiong, et al., 200930. m/0.32 mm/0.25 μm, Helium, 40. C @ 4. min, 4. K/min; Tend: 240. C

Normal alkane RI, polar column, custom temperature program

View large format table.

Column type Active phase I Reference Comment
CapillaryDB-Wax2725.Loscos, Hernandez-Orte, et al., 200960. m/0.25 mm/0.50 μm, Helium; Program: 40 0C (3 min) 10 0C/min -> 90 0C 2 0C/min -> 230 0C (37 min)

References

Zhannan, Shiqiong, et al., 2009
Zhannan, Y.; Shiqiong, L.; Quancai, P.; Chao, Z.; Zhengwen, Y., GC-MS analysis of the essential oil of Coral Ginger (Zingiber corallinum Hance) rhizome obtained by supercritical fluid extraction and steam distillation extraction, Chromatographia, 2009, 69, 7/8, 785-790, https://doi.org/10.1365/s10337-009-0971-9 . [all data]

Loscos, Hernandez-Orte, et al., 2009
Loscos, N.; Hernandez-Orte, P.; Cacho, J.; Ferreira, V., Fate of grape flavor precursors during storage on yeast lees, J. Agric. Food Chem., 2009, 57, 12, 5468-5479, https://doi.org/10.1021/jf804057q . [all data]