Ether, hexyl t-butyl

Normal alkane RI, non-polar column, isothermal

View large format table.

Column type Active phase Temperature (C) I Reference Comment
CapillaryDB-560.998.Verevkin, Krasnykh, et al., 200360. m/0.32 mm/0.25 μm, Nitrogen

Phase change data

Data compiled by: William E. Acree, Jr., James S. Chickos

Quantity Value Units Method Reference Comment
Δvap12.7kcal/molCGCVerevkin, 2002See also Verevkin, Krasnykh, et al., 2003.

References

Verevkin, Krasnykh, et al., 2003
Verevkin, Sergey P.; Krasnykh, Eugen L.; Vasiltsova, Tatiana V.; Heintz, Andreas, Determination of Ambient Temperature Vapor Pressures and Vaporization Enthalpies of Branched Ethers, J. Chem. Eng. Data, 2003, 48, 3, 591-599, https://doi.org/10.1021/je0255980 . [all data]