Sulfur fluoride cation

Gas phase thermochemistry data

Quantity Value Units Method Reference Comment
gas,1 bar263.53J/mol*KReviewChase, 1998Data last reviewed in December, 1976

Reaction thermochemistry data

Data compiled by: Michael M. Meot-Ner (Mautner) and Sharon G. Lias

Individual Reactions

(F2S+ • 2F6S-) + F6S- = (F2S+ • 3F6S-)

By formula: (F2S+ • 2F6S-) + F6S- = (F2S+ • 3F6S-)

Quantity Value Units Method Reference Comment
Δr18.kJ/molPHPMSHiraoka, Shimizu, et al., 1995gas phase
Quantity Value Units Method Reference Comment
Δr84.J/mol*KPHPMSHiraoka, Shimizu, et al., 1995gas phase

(F2S+ • F6S-) + F6S- = (F2S+ • 2F6S-)

By formula: (F2S+ • F6S-) + F6S- = (F2S+ • 2F6S-)

Quantity Value Units Method Reference Comment
Δr21.kJ/molPHPMSHiraoka, Shimizu, et al., 1995gas phase
Quantity Value Units Method Reference Comment
Δr92.J/mol*KPHPMSHiraoka, Shimizu, et al., 1995gas phase

F2S+ + F6S- = (F2S+ • F6S-)

By formula: F2S+ + F6S- = (F2S+ • F6S-)

Quantity Value Units Method Reference Comment
Δr33.kJ/molPHPMSHiraoka, Shimizu, et al., 1995gas phase
Quantity Value Units Method Reference Comment
Δr75.J/mol*KPHPMSHiraoka, Shimizu, et al., 1995gas phase

References

Chase, 1998
Chase, M.W., Jr., NIST-JANAF Themochemical Tables, Fourth Edition, J. Phys. Chem. Ref. Data, Monograph 9, 1998, 1-1951. [all data]

Hiraoka, Shimizu, et al., 1995
Hiraoka, K.; Shimizu, A.; Minamitsu, A.; Nasu, M. Fujimaki, Gas-Phase Stability of Cluster Ions SFm+(SF6)n with m = 0-5 and n = 1-3, J. Am. Soc. Mass Spectrom., 1995, 6, 12, 1137, https://doi.org/10.1016/1044-0305(95)00583-8 . [all data]