2(3H)-Furanone, dihydro-4,5-dimethyl-

Normal alkane RI, non-polar column, temperature ramp

Data compiled by: NIST Mass Spectrometry Data Center, William E. Wallace, director

Column type CapillaryCapillary
Active phase HP-5 MSUltra-2
Column length (m) 30.50.
Carrier gas HeliumHe
Substrate
Column diameter (mm) 0.250.32
Phase thickness (μm) 0.250.52
Tstart (C) 50.40.
Tend (C) 320.250.
Heat rate (K/min) 5.4.
Initial hold (min) 5.3.
Final hold (min)  30.
I 984.939.
ReferenceNawrath, Mgode, et al., 2012King, Hamilton, et al., 1993
Comment MSDC-RI MSDC-RI

References

Nawrath, Mgode, et al., 2012
Nawrath, T.; Mgode, G.F.; Weetjens, B.; Kaufmann, S.H.E.; Schulz, S., The volatiles of pathogenic and nonpathogenic mycobacteria aand related bacteria, Beilstein J. Org. Chem., 2012, 8, 290-297, https://doi.org/10.3762/bjoc.8.31 . [all data]

King, Hamilton, et al., 1993
King, M.-F.; Hamilton, B.L.; Matthews, M.A.; Rule, D.C.; Field, R.A., Isolation and identification of volatiles and condensable material in raw beef with supercritical carbon dioxide extraction, J. Agric. Food Chem., 1993, 41, 11, 1974-1981, https://doi.org/10.1021/jf00035a030 . [all data]