2-Pyridinamine, 4-methyl-

Phase change data

Data compiled by: Robert L. Brown and Stephen E. Stein

Quantity Value Units Method Reference Comment
Tboil503.2KN/AAldrich Chemical Company Inc., 1990
Tboil473. - 523.KN/ABuckingham and Donaghy, 1982
Quantity Value Units Method Reference Comment
Tfus371.KN/ABuckingham and Donaghy, 1982

Kovats' RI, non-polar column, isothermal

View large format table.

Column type Active phase Temperature (C) I Reference Comment
CapillaryOV-101150.1153.Terenina, Zhuravieva, et al., 199750. m/0.3 mm/0.4 μm, He

Kovats' RI, polar column, isothermal

View large format table.

Column type Active phase Temperature (C) I Reference Comment
CapillaryPEG-40M150.2001.Terenina, Zhuravieva, et al., 199750. m/0.3 mm/0.4 μm, He

Van Den Dool and Kratz RI, non-polar column, temperature ramp

View large format table.

Column type Active phase I Reference Comment
CapillaryDB-51113.Premecz and Ford, 1987He, 60. C @ 10. min, 10. K/min, 280. C @ 3. min; Column length: 30. m; Column diameter: 0.32 mm

Van Den Dool and Kratz RI, polar column, temperature ramp

View large format table.

Column type Active phase I Reference Comment
CapillaryCAM1952.Premecz and Ford, 1987He, 60. C @ 5. min, 5. K/min, 240. C @ 21. min; Column length: 15. m; Column diameter: 0.24 mm

References

Aldrich Chemical Company Inc., 1990
Aldrich Chemical Company Inc., Catalog Handbook of Fine Chemicals, Aldrich Chemical Company, Inc., Milwaukee WI, 1990, 1. [all data]

Buckingham and Donaghy, 1982
Buckingham, J.; Donaghy, S.M., Dictionary of Organic Compounds: Fifth Edition, Chapman and Hall, New York, 1982, 1. [all data]

Terenina, Zhuravieva, et al., 1997
Terenina, M.B.; Zhuravieva, I.L.; Golovnya, R.V., Peculiar features of sorption of positional isomers of formyl-, acetyl-, and aminopyridines in capillary gas-liquid chromatography, Russ. Chem. Bull. (Engl. Transl.), 1997, 46, 1, 86-89, https://doi.org/10.1007/BF02495353 . [all data]

Premecz and Ford, 1987
Premecz, J.E.; Ford, M.E., Gas chromatographic separation of substituted pyridines, J. Chromatogr., 1987, 388, 23-35, https://doi.org/10.1016/S0021-9673(01)94463-2 . [all data]