2(3H)-Furanone, 5-ethyldihydro-

Normal alkane RI, polar column, temperature ramp

Data compiled by: NIST Mass Spectrometry Data Center, William E. Wallace, director

Column type CapillaryCapillaryCapillaryCapillaryCapillary
Active phase AT-WaxDB-WaxDB-WaxCarbowax 20MDB-Wax
Column length (m) 60.30.60.50.60.
Carrier gas HeliumHeHeHelium
Substrate
Column diameter (mm) 0.250.250.250.700.25
Phase thickness (μm) 0.250.250.25
Tstart (C) 60.30.40.50.60.
Tend (C) 280.210.220.280.180.
Heat rate (K/min) 4.5.3.4.3.
Initial hold (min)   5.2.4.
Final hold (min)
I 1728.1724.1710.1672.1709.
ReferenceKiss, Csoka, et al., 2011Kumazawa, Itobe, et al., 2008López, Ezpeleta, et al., 2004Saura, LAencina, et al., 2003Ito, Sugimoto, et al., 2002
Comment MSDC-RI MSDC-RI MSDC-RI MSDC-RI MSDC-RI
Column type CapillaryCapillaryCapillaryCapillaryCapillary
Active phase TC-WaxDB-WaxDB-WaxDB-WaxDB-Wax
Column length (m) 60.30.25.25.60.
Carrier gas HeHeHeHeNitrogen
Substrate
Column diameter (mm) 0.250.250.250.250.25
Phase thickness (μm) 0.250.250.250.25
Tstart (C) 40.50.50.50.40.
Tend (C) 230.180.200.200.200.
Heat rate (K/min) 3.3.4.4.2.
Initial hold (min) 10. 4.4.10.
Final hold (min) 10.40.10.10.
I 1710.1664.1682.1706.1715.
ReferenceSuhardi, Suzuki, et al., 2002Lee and Shibamoto, 2000Morales, Duque, et al., 2000Morales, Duque, et al., 2000Tamura, Boonbumrung, et al., 2000
Comment MSDC-RI MSDC-RI MSDC-RI MSDC-RI MSDC-RI
Column type CapillaryCapillaryCapillaryCapillaryCapillary
Active phase DB-WaxDB-WaxDB-WaxDB-WaxDB-Wax
Column length (m) 60.30.60.30.30.
Carrier gas   HeHeHe
Substrate
Column diameter (mm) 0.320.530.250.250.25
Phase thickness (μm)   0.250.250.25
Tstart (C) 30.60.40.50.50.
Tend (C) 170.210.200.240.240.
Heat rate (K/min) 2.4.2.4.4.
Initial hold (min) 4. 2.3.3.
Final hold (min) 60.  10.10.
I 1699.1721.1696.1682.1688.
ReferenceButtery, Orts, et al., 1999Iwatsuki, Mizota, et al., 1999Umano, Nakahara, et al., 1999Parada and Duque, 1998Parada and Duque, 1998
Comment MSDC-RI MSDC-RI MSDC-RI MSDC-RI MSDC-RI
Column type CapillaryCapillaryCapillaryCapillaryCapillary
Active phase PEG-20MTC-WaxSupelcowax-10Carbowax 20MCarbowax 20M
Column length (m) 50.60.90.60.50.
Carrier gas Nitrogen He He
Substrate
Column diameter (mm) 0.250.250.250.250.25
Phase thickness (μm) 0.25 0.25
Tstart (C) 60.80.35.60.60.
Tend (C) 180.240.220.180.180.
Heat rate (K/min) 2.3.2.2.2.
Initial hold (min)  5.20.4.4.
Final hold (min)   30.
I 1655.1720.1671.1660.1660.
ReferenceKubota, Matsujage, et al., 1996Shuichi, Masazumi, et al., 1996Girard and Lau, 1995Kawakami, Ganguly, et al., 1995Kawakami, Kobayashi, et al., 1993
Comment MSDC-RI MSDC-RI MSDC-RI MSDC-RI MSDC-RI
Column type CapillaryCapillaryCapillaryCapillaryCapillary
Active phase DB-WaxCarbowax 20MCarbowax 20MDB-WaxDB-Wax
Column length (m) 60.50.50.60.60.
Carrier gas HeN2N2H2H2
Substrate
Column diameter (mm) 0.3220.220.220.250.25
Phase thickness (μm) 0.25  0.250.25
Tstart (C) 50.80.80.30.30.
Tend (C) 230.200.200.180.180.
Heat rate (K/min) 4.3.3.2.2.
Initial hold (min)    2.2.
Final hold (min)
I 1694.1710.1715.1683.1684.
ReferenceEngel, Flath, et al., 1988Mihara, Tateba, et al., 1988Mihara, Tateba, et al., 1988Takeoka, Flath, et al., 1988Takeoka, Flath, et al., 1988
Comment MSDC-RI MSDC-RI MSDC-RI MSDC-RI MSDC-RI
Column type CapillaryCapillaryCapillary
Active phase Carbowax 20MCarbowax 20MCarbowax 20M
Column length (m) 50.50.150.
Carrier gas N2N2
Substrate
Column diameter (mm) 0.220.220.64
Phase thickness (μm)
Tstart (C) 80.80.50.
Tend (C) 200.200.170.
Heat rate (K/min) 3.3.1.
Initial hold (min)   30.
Final hold (min)   60.
I 1710.1715.1680.
ReferenceMihara, Tateba, et al., 1987Mihara, Tateba, et al., 1987Buttery, Ling, et al., 1983
Comment MSDC-RI MSDC-RI MSDC-RI

Phase change data

Data compiled as indicated in comments:
BS - Robert L. Brown and Stephen E. Stein
AC - William E. Acree, Jr., James S. Chickos

Quantity Value Units Method Reference Comment
Tboil492.2KN/AAldrich Chemical Company Inc., 1990BS
Quantity Value Units Method Reference Comment
Δvap57.2 ± 0.3kJ/molGSEmel'yanenko, Kozlova, et al., 2008Based on data from 283. - 353. K. See also Emel'yanenko, Verevkin, et al., 2009.; AC
Δvap55.3 ± 0.6kJ/molN/ACovarrubias-Cervantes, Mokbel, et al., 2004Based on data from 243. - 298. K. See also Emel'yanenko, Kozlova, et al., 2008.; AC

References

Kiss, Csoka, et al., 2011
Kiss, M.; Csoka, M.; Gyorfi, J.; Korany, K., Comparison of the fragrance constituents of Tuber aestivium and Tuber Brumale gathered in Hungary, J. Appl. Botany Food Quality, 2011, 84, 102-110. [all data]

Kumazawa, Itobe, et al., 2008
Kumazawa, K.; Itobe, T.; Nishimura, O.; Hamaguchi, T., A new approach to estimate the in-mouth release characteristics of odorants in chewing gum, Food Science and Technology Research, 2008, 14, 3, 269-276, https://doi.org/10.3136/fstr.14.269 . [all data]

López, Ezpeleta, et al., 2004
López, R.; Ezpeleta, E.; Sánchez, I.; Cacho, J.; Ferreira, V., Analysis of the aroma intensities of volatile compounds released from mild acid hydrolysates of odourless precursors extracted from Tempranillo and Grenache grapes using gas chromatography-olfactometry, Food Chem., 2004, 88, 1, 95-103, https://doi.org/10.1016/j.foodchem.2004.01.025 . [all data]

Saura, LAencina, et al., 2003
Saura, D.; LAencina, J.; Perez-Lopez, A.J.; Lizama, V.; Carbonell-Barrachina, A.A., Aroma of canned peach halves acidified with clarified lemon juice, J. Food Sci., 2003, 68, 3, 1080-1085, https://doi.org/10.1111/j.1365-2621.2003.tb08292.x . [all data]

Ito, Sugimoto, et al., 2002
Ito, Y.; Sugimoto, A.; Kakuda, T.; Kubota, K., Identification of potent odorants in Chinese jasmine green tea scented with flowers of Jasminum sambac, J. Agric. Food Chem., 2002, 50, 17, 4878-4884, https://doi.org/10.1021/jf020282h . [all data]

Suhardi, Suzuki, et al., 2002
Suhardi, S.; Suzuki, M.; Yoshida, K.; Muto, T.; Fujita, A.; Watanbe, N., Changes in the volatile compounds and in the chemical and physical properties of snake fruit (Salacca edulis Reinw) Cv. Pondoh during maturation, J. Agric. Food Chem., 2002, 50, 26, 7627-7633, https://doi.org/10.1021/jf020620e . [all data]

Lee and Shibamoto, 2000
Lee, K.-G.; Shibamoto, T., Antioxidant properties of aroma compounds isolated from soybeans and mung beans, J. Agric. Food Chem., 2000, 48, 9, 4290-4293, https://doi.org/10.1021/jf000442u . [all data]

Morales, Duque, et al., 2000
Morales, A.L.; Duque, C.; Bautista, E., Identification of free and glycosidically bound volatiles and glycosides by capillary GC and capillary GC-MS in Lulo del Chocó (Solanum topiro), J. Hi. Res. Chromatogr., 2000, 23, 5, 379-385, https://doi.org/10.1002/(SICI)1521-4168(20000501)23:5<379::AID-JHRC379>3.0.CO;2-B . [all data]

Tamura, Boonbumrung, et al., 2000
Tamura, H.; Boonbumrung, S.; Yoshizawa, T.; Varanyanond, W., Volatile components of the essential oil in the pulp of four yellow mangoes (Mangifera indica L.) in Thailand, Food Sci. Technol. Res., 2000, 6, 1, 68-73, https://doi.org/10.3136/fstr.6.68 . [all data]

Buttery, Orts, et al., 1999
Buttery, R.G.; Orts, W.J.; Takeoka, G.R.; Nam, Y., Volatile flavor components of rice cakes, J. Agric. Food Chem., 1999, 47, 10, 4353-4356, https://doi.org/10.1021/jf990140w . [all data]

Iwatsuki, Mizota, et al., 1999
Iwatsuki, K.; Mizota, Y.; Kubota, T.; Nishimura, O.; Masuda, H.; Sotoyama, K.; Tomita, M., Aroma extract dilution analysis. Evluation of aroma of pasteurized and UHT processed milk by aroma extract dilution analysis, Nippon Shokuhin Kagaku Kogaku Kaishi, 1999, 46, 9, 587-597, https://doi.org/10.3136/nskkk.46.587 . [all data]

Umano, Nakahara, et al., 1999
Umano, K.; Nakahara, K.; Shoji, A.; Shibamoto, T., Aroma chemicals isolated and identified from leaves of aloe arborescens Mill. Var. natalensis Berger, J. Agric. Food Chem., 1999, 47, 9, 3702-3705, https://doi.org/10.1021/jf990116i . [all data]

Parada and Duque, 1998
Parada, F.; Duque, C., Studies on the aroma of piñuela fruit pulp (Bromelia plumieri): Free and bound volatile composition and characterization of some glucoconjugates as aroma precursors, J. Hi. Res. Chromatogr., 1998, 21, 10, 577-581, https://doi.org/10.1002/(SICI)1521-4168(19981001)21:10<577::AID-JHRC577>3.0.CO;2-V . [all data]

Kubota, Matsujage, et al., 1996
Kubota, K.; Matsujage, Y.; Sekiwa, Y.; Kobayashi, A., Identification of the characteristic volatile flavor compounds formed by cooking squid (Todarodes pacificus Steenstrup), Food Sci. Technol., 1996, 2, 3, 163-166. [all data]

Shuichi, Masazumi, et al., 1996
Shuichi, H.; Masazumi, N.; Hiromu, K.; Kiyoshi, F., Comparison of volatile compounds berween the crude drugs, Onji-tsutsu and Onji-niki, Nippon nogei kagaku kaishi, 1996, 70, 2, 151-160. [all data]

Girard and Lau, 1995
Girard, B.; Lau, O.L., Effect of maturity and storage on quality and volatile production of 'Jonagold' apples, Food Res. Int., 1995, 28, 5, 465-471, https://doi.org/10.1016/0963-9969(96)81393-7 . [all data]

Kawakami, Ganguly, et al., 1995
Kawakami, M.; Ganguly, S.N.; Banerjee, J.; Kobayashi, A., Aroma composition of oolong tea and black tea by brewed extraction method and characterizing compounds of Darjeeling tea aroma, J. Agric. Food Chem., 1995, 43, 1, 200-207, https://doi.org/10.1021/jf00049a037 . [all data]

Kawakami, Kobayashi, et al., 1993
Kawakami, M.; Kobayashi, A.; Kator, K., Volatile constituents of Rooibos tea (Aspalathus linearis) as affected by extraction process, J. Agric. Food Chem., 1993, 41, 4, 633-636, https://doi.org/10.1021/jf00028a023 . [all data]

Engel, Flath, et al., 1988
Engel, K.-H.; Flath, R.A.; Buttery, R.G.; Mon, T.R.; Ramming, D.W.; Teranishi, R., Investigation of volatile constituents in nectarines. 1. Analytical and sensory characterization of aroma components in some nectarine cultivars, J. Agric. Food Chem., 1988, 36, 3, 549-553, https://doi.org/10.1021/jf00081a036 . [all data]

Mihara, Tateba, et al., 1988
Mihara, S.; Tateba, H.; Nishimura, O.; Machii, Y.; Kishino, K., The volatile components of Chinese quince (Pseudocydonia sinensis Schneid) in Flavors and Fragrances: A World Perspective. Proceedings of the 10th International Congress of Essential Oils, Fragrances and Flavors, Lawrence,B.M.; Mookherjee,B.D.; Willis,B.J., ed(s)., Elsevier, New York, 1988, 537-550. [all data]

Takeoka, Flath, et al., 1988
Takeoka, G.R.; Flath, R.A.; Güntert, M.; Jennings, W., Nectarine volatiles: vacuum steam distillation versus headspace sampling, J. Agric. Food Chem., 1988, 36, 3, 553-560, https://doi.org/10.1021/jf00081a037 . [all data]

Mihara, Tateba, et al., 1987
Mihara, S.; Tateba, H.; Nishimura, O.; Machii, Y.; Kishino, K., Volatile components of Chinese quince (Pseudocydonia sinensis Schneid), J. Agric. Food Chem., 1987, 35, 4, 532-537, https://doi.org/10.1021/jf00076a023 . [all data]

Buttery, Ling, et al., 1983
Buttery, R.G.; Ling, L.C.; Teranishi, R.; Mon, T.R., Insect attractants: volatiles of hydrolizyed protein insect baits, J. Agric. Food Chem., 1983, 31, 4, 689-692, https://doi.org/10.1021/jf00118a003 . [all data]