1-Hexanamine, N-hexyl-N-nitroso-

Kovats' RI, non-polar column, isothermal

View large format table.

Column type Active phase Temperature (C) I Reference Comment
PackedSE-52210.1705.Gough and Webb, 1974He; Column length: 1.5 m

References

Gough and Webb, 1974
Gough, T.A.; Webb, K.S., The Trace Detection of Some Non-Volatile Nitrosamines by Combined Gas Chromatography and Mass Spectrometry, J. Chromatogr., 1974, 95, 1, 59-63, https://doi.org/10.1016/S0021-9673(00)84095-9 . [all data]