Ethyl dl-2-hydroxycaproate

Normal alkane RI, non-polar column, custom temperature program

Data compiled by: NIST Mass Spectrometry Data Center, William E. Wallace, director

Column type CapillaryCapillaryCapillary
Active phase HP-5HP-5HP-1
Column length (m) 30.30.25.
Carrier gas
Substrate
Column diameter (mm) 0.250.250.32
Phase thickness (μm) 0.250.25
Program 40 0C (2 min) 5 0C/min -> 80 0C 7 oC/min -> 160 0C 9 0C/min -> 200 0C 20 0C/min -> 280 0C (10 min)not specifiednot specified
I 1077.1062.1041.
ReferenceZhao, Li, et al., 2008Zhao, Li, et al., 2008Ong, Acree, et al., 1998
Comment MSDC-RI MSDC-RI MSDC-RI

Normal alkane RI, polar column, custom temperature program

Data compiled by: NIST Mass Spectrometry Data Center, William E. Wallace, director

Column type CapillaryCapillaryCapillary
Active phase DB-WaxDB-WaxDB-Wax
Column length (m) 30.30.30.
Carrier gas HeliumHeliumHe
Substrate
Column diameter (mm) 0.250.320.25
Phase thickness (μm) 0.250.250.25
Program not specified50 0C 20 0C/min -> 80 0C 3 0C/min -> 230 0C50 0C (2 min) 6 0C/min -> 150 0C 8 0C/min -> 230 0C (15 min)
I 1544.1531.1552.
ReferenceZhao, Xu, et al., 2009Tao, Wenlai, et al., 2008Tian, Zhang, et al., 2007
Comment MSDC-RI MSDC-RI MSDC-RI

Phase change data

Data compiled by: Robert L. Brown and Stephen E. Stein

Quantity Value Units Method Reference Comment
Tboil468.2KN/AAldrich Chemical Company Inc., 1990

References

Zhao, Li, et al., 2008
Zhao, Y.; Li, J.; Xu, Y.; Duan, H.; Fan, W.; Zhao, G., EXtraction, preparation and identification of volatile compounds in Changyu XO brandy, Chinese J. Chromatogr., 2008, 26, 2, 212-222, https://doi.org/10.1016/S1872-2059(08)60014-0 . [all data]

Ong, Acree, et al., 1998
Ong, P.K.C.; Acree, T.E.; Lavin, E.H., Characterization of volatiles in rambutan fruit (Nephelium lappaceum L.), J. Agric. Food Chem., 1998, 46, 2, 611-615, https://doi.org/10.1021/jf970665t . [all data]