2-Propanol, 1-chloro-3-propoxy-

Normal alkane RI, non-polar column, temperature ramp

View large format table.

Column type Active phase I Reference Comment
PackedSE-301060.Zenkevich and Drugov, 1987Helium, Chromosorb W (60-80 mesh), 50. C @ 0. min, 5. K/min, 150. C @ 0. min; Column length: 1.8 m

Normal alkane RI, non-polar column, custom temperature program

View large format table.

Column type Active phase I Reference Comment
CapillaryOV-1011057.Zenkevich and Malamakhov, 1987He; Column length: 50. m; Column diameter: 0.24 mm; Program: not specified

References

Zenkevich and Drugov, 1987
Zenkevich, I.G.; Drugov, M.V., Chromato Mass Spectrometric Characterization of Alkoxychlorohydrines and their Trimethylsilyl Ethers, Theoretical and Experim. Chemistry (Rus.), 1987, 225-230. [all data]

Zenkevich and Malamakhov, 1987
Zenkevich, I.G.; Malamakhov, A.C., Evaluation of Molecular Weights of Organic Compounds based on Retention Parameters at Chromato-Spectral Analysys. Additional Criterion of Molecular Ions' Identification, Vestn. St. Petersb. Univ. Ser. 4: Fiz. Khim, 1987, 2, 101-106. [all data]