CH2Br2+

Vibrational and/or electronic energy levels

Data compiled by: Marilyn E. Jacox

State:   G

 Energy
 (cm-1
 Med.   Transition   λmin
 (nm)
 λmax
 (nm)

References

Tx = 74070 ± 800 gas Potts, Lempka, et al., 1970

State:   F

 Energy
 (cm-1
 Med.   Transition   λmin
 (nm)
 λmax
 (nm)

Tx = 46230 ± 560 gas Potts, Lempka, et al., 1970

State:   E

 Energy
 (cm-1
 Med.   Transition   λmin
 (nm)
 λmax
 (nm)

Tx = 34130 ± 560 gas Potts, Lempka, et al., 1970

State:   D

 Energy
 (cm-1
 Med.   Transition   λmin
 (nm)
 λmax
 (nm)

Tx = 29040 ± 560 gas Potts, Lempka, et al., 1970

State:   B,C

 Energy
 (cm-1
 Med.   Transition   λmin
 (nm)
 λmax
 (nm)

Tx = 6130 ± 560 gas Potts, Lempka, et al., 1970

State:   A

 Energy
 (cm-1
 Med.   Transition   λmin
 (nm)
 λmax
 (nm)

Tx = 2420 ± 560 gas Potts, Lempka, et al., 1970

Additional references: Jacox, 1994, page 261; Dixon, Murrell, et al., 1971; Tsai, Baer, et al., 1975

Potts, Lempka, et al., 1970
Potts, A.W.; Lempka, H.J.; Streets, D.G.; Price, W.C., Photoelectron spectra of the halides of elements in groups III, IV, V and VI, Phil. Trans. Roy. Soc. (London), 1970, A268, 59. [all data]

Jacox, 1994
Jacox, M.E., Vibrational and electronic energy levels of polyatomic transient molecules, American Chemical Society, Washington, DC, 1994, 464. [all data]

Dixon, Murrell, et al., 1971
Dixon, R.N.; Murrell, J.N.; Narayan, B., The photoelectron spectra of the halomethanes, Mol. Phys., 1971, 20, 611. [all data]

Tsai, Baer, et al., 1975
Tsai, B.P.; Baer, T.; Werner, A.S.; Lin, S.F., A photoelectron-photoion coincidence study of the ionization and fragment appearance potentials of bromo- and iodomethanes, J. Phys. Chem., 1975, 79, 570. [all data]