Oxirane, tetrafluoro-

Normal alkane RI, non-polar column, custom temperature program

View large format table.

Column type Active phase I Reference Comment
CapillaryPorapack Q254.Zenkevich and Rodin, 2004Program: not specified

References

Zenkevich and Rodin, 2004
Zenkevich, I.G.; Rodin, A.A., Gas chromatographic identification of some volatile toxic fluorine containing compounds by precalculated retention indices, J. Ecol. Chem. (Rus.), 2004, 13, 1, 22-28. [all data]