Isothiazole, 3-methyl-

Gas phase ion energetics data

Data compiled by: Sharon G. Lias, Rhoda D. Levin, and Sherif A. Kafafi

Ionization energy determinations

IE (eV) Method Reference
9.60EISalmona, Ferre, et al., 1971

References

Salmona, Ferre, et al., 1971
Salmona, G.; Ferre, Y.; Vincent, E.J., Etudes experimentales et theoriques de potentiels d'ionisation de derives de la serie de l'isothiazole, C.R. Acad. Sci. Ser. 3:, 1971, 273, 863. [all data]