Hexanoic acid, phenylmethyl ester

Kovats' RI, non-polar column, isothermal

View large format table.

Column type Active phase Temperature (C) I Reference Comment
CapillarySE-30200.1531.Tarjan, Nyiredy, et al., 1989
PackedSE-30200.1531.Haken, Hartley, et al., 1983Chromosorb W AW DMCS; Column length: 3.7 m

Van Den Dool and Kratz RI, polar column, temperature ramp

View large format table.

Column type Active phase I Reference Comment
CapillarySupelcowax2052.Bassole, Ouattara, et al., 200330. m/0.25 mm/0.25 μm, He, 2. K/min, 240. C @ 10. min; Tstart: 40. C

Normal alkane RI, non-polar column, temperature ramp

View large format table.

Column type Active phase I Reference Comment
CapillaryHP-5 MS1549.Pino, Marquez, et al., 201030. m/0.32 mm/0.25 μm, Helium, 50. C @ 2. min, 4. K/min, 240. C @ 10. min
CapillaryHP-5 MS1511.Forero, Quijano, et al., 200830. m/0.25 mm/0.25 μm, Helium, 50. C @ 4. min, 4. K/min, 230. C @ 10. min
CapillaryUltra-11506.Okumura, 199125. m/0.32 mm/0.25 μm, He, 3. K/min; Tstart: 80. C; Tend: 260. C

Normal alkane RI, non-polar column, custom temperature program

View large format table.

Column type Active phase I Reference Comment
CapillaryHP-5 MS1547.Pino, Marquez, et al., 201030. m/0.32 mm/0.25 μm, Helium; Program: not specified
CapillarySE-301521.Vinogradov, 2004Program: not specified

Normal alkane RI, polar column, custom temperature program

View large format table.

Column type Active phase I Reference Comment
CapillaryCarbowax 20M2057.Vinogradov, 2004Program: not specified

References

Tarjan, Nyiredy, et al., 1989
Tarjan, G.; Nyiredy, Sz.; Gyor, M.; Lombosi, E.R.; Lombosi, T.S.; Budahegyi, M.V.; Meszaros, S.Y.; Takacs, J.M., Review. Thirtieth Anniversary of the Retention Index According to Kovats in Gas-Liquid Chromatography, J. Chromatogr., 1989, 472, 1-92, https://doi.org/10.1016/S0021-9673(00)94099-8 . [all data]

Haken, Hartley, et al., 1983
Haken, J.K.; Hartley, H.N.T.; Srisukh, D., Retention increments of aromatic esters, Chromatographia, 1983, 17, 11, 589-596, https://doi.org/10.1007/BF02261941 . [all data]

Bassole, Ouattara, et al., 2003
Bassole, I.H.N.; Ouattara, A.S.; Nebie, R.; Ouattara, C.A.T.; Kabore, Z.I.; Traore, S.A., Chemical composition and antibacterial activities of the essential oils of Lippia chevalieri and Lippia multiflora from Burkina Faso, Phytochemistry, 2003, 62, 2, 209-212, https://doi.org/10.1016/S0031-9422(02)00477-6 . [all data]

Pino, Marquez, et al., 2010
Pino, J.A.; Marquez, E.; Quijano, C.E.; Castro, D., Volatile compounds in noni (Morinda citrifolia L.) at two ripening stages, Ciencia e Technologia de Alimentos, 2010, 30, 1, 183-187, https://doi.org/10.1590/S0101-20612010000100028 . [all data]

Forero, Quijano, et al., 2008
Forero, M.D.; Quijano, C.E.; Pino, J.A., Volatile compounds of Chile pepper (Capsicum annuum L. var. glabriusculum) at two ripening stages, Flavour Fragr. J., 2008, 24, 1, 25-30, https://doi.org/10.1002/ffj.1913 . [all data]

Okumura, 1991
Okumura, T., retention indices of environmental chemicals on methyl silicone capillary column, Journal of Environmental Chemistry (Japan), 1991, 1, 2, 333-358, https://doi.org/10.5985/jec.1.333 . [all data]

Vinogradov, 2004
Vinogradov, B.A., Production, composition, properties and application of essential oils, 2004, retrieved from http://viness.narod.ru. [all data]