Dodecanedioic acid

Condensed phase thermochemistry data

Data compiled by: Hussein Y. Afeefy, Joel F. Liebman, and Stephen E. Stein

Quantity Value Units Method Reference Comment
Δcsolid-6736.2 ± 2.8kJ/molCcbVerkade, Hartman, et al., 1926Reanalyzed by Cox and Pilcher, 1970, Original value = -6739.2 kJ/mol; See Verkade, Hartman, et al., 1924; Corresponding Δfsolid = -1130.0 kJ/mol (simple calculation by NIST; no Washburn corrections)

Phase change data

Data compiled as indicated in comments:
BS - Robert L. Brown and Stephen E. Stein
TRC - Thermodynamics Research Center, NIST Boulder Laboratories, Chris Muzny director
AC - William E. Acree, Jr., James S. Chickos
ALS - Hussein Y. Afeefy, Joel F. Liebman, and Stephen E. Stein
DH - Eugene S. Domalski and Elizabeth D. Hearing

Quantity Value Units Method Reference Comment
Tfus402.5KN/ACingolani and Berchiesi, 1974Uncertainty assigned by TRC = 0.5 K; TRC
Quantity Value Units Method Reference Comment
Δvap130.0 ± 2.3kJ/molCGCRoux, Temprado, et al., 2005Based on data from 424. - 503. K.; AC
Quantity Value Units Method Reference Comment
Δsub153. ± 3.kJ/molVDavies and Thomas, 1960ALS

Reduced pressure boiling point

Tboil (K) Pressure (bar) Reference Comment
518.20.013Aldrich Chemical Company Inc., 1990BS

Enthalpy of sublimation

ΔsubH (kJ/mol) Temperature (K) Method Reference Comment
169. ± 4.346. - 377.TPDCappa, Lovejoy, et al., 2007AC
156.298. - 316.TPTDChattopadhyay and Ziemann, 2005AC
153.1 ± 2.9386.MEDavies and Thomas, 1960Based on data from 375. - 296. K. See also Cox and Pilcher, 1970, 2.; AC

Enthalpy of fusion

ΔfusH (kJ/mol) Temperature (K) Method Reference Comment
50.564402.5N/ACingolani and Berchiesi, 1974DH
52.5401.6N/AVentolà, Bayés, et al., 2008AC
49.8400.3DSCRoux, Temprado, et al., 2005AC
50.57402.5N/ADomalski and Hearing, 1996AC

Entropy of fusion

ΔfusS (J/mol*K) Temperature (K) Reference Comment
125.60402.5Cingolani and Berchiesi, 1974DH

In addition to the Thermodynamics Research Center (TRC) data available from this site, much more physical and chemical property data is available from the following TRC products:

References

Verkade, Hartman, et al., 1926
Verkade, P.E.; Hartman, H.; Coops, J., Calorimetric researches. X. Heats of combustion of successive terms of homologous series: dicarboxylic acids of the oxalic acid series, Rec. Trav. Chim. Pays/Bas, 1926, 45, 373-393. [all data]

Cox and Pilcher, 1970
Cox, J.D.; Pilcher, G., Thermochemistry of Organic and Organometallic Compounds, Academic Press, New York, 1970, 1-636. [all data]

Verkade, Hartman, et al., 1924
Verkade, P.E.; Hartman, H.; Coops, J., Jr., Chemistry - The molecular heat of combustion of successive terms of homologous series, Kom. Med. Akad. Ueknschap. Proc., 1924, 27, 859-866. [all data]

Cingolani and Berchiesi, 1974
Cingolani, A.; Berchiesi, G., Thermodynamic properties of organic compounds. 1. A DSC study of phase transitions in aliphatic dicarboxylic acids, J. Therm. Anal., 1974, 6, 87-90. [all data]

Roux, Temprado, et al., 2005
Roux, Maria Victoria; Temprado, Manuel; Chickos, James S., Vaporization, fusion and sublimation enthalpies of the dicarboxylic acids from C4 to C14 and C16, The Journal of Chemical Thermodynamics, 2005, 37, 9, 941-953, https://doi.org/10.1016/j.jct.2004.12.011 . [all data]

Davies and Thomas, 1960
Davies, M.; Thomas, G.H., The lattice energies, infra-red spectra, and possible cyclization of some dicarboxylic acids, Trans. Faraday Soc., 1960, 56, 185. [all data]

Aldrich Chemical Company Inc., 1990
Aldrich Chemical Company Inc., Catalog Handbook of Fine Chemicals, Aldrich Chemical Company, Inc., Milwaukee WI, 1990, 1. [all data]

Cappa, Lovejoy, et al., 2007
Cappa, Christopher D.; Lovejoy, Edward R.; Ravishankara, A.R., Determination of Evaporation Rates and Vapor Pressures of Very Low Volatility Compounds: A Study of the C 4 -C 10 and C 12 Dicarboxylic Acids, J. Phys. Chem. A, 2007, 111, 16, 3099-3109, https://doi.org/10.1021/jp068686q . [all data]

Chattopadhyay and Ziemann, 2005
Chattopadhyay, Sulekha; Ziemann, Paul J., Vapor Pressures of Substituted and Unsubstituted Monocarboxylic and Dicarboxylic Acids Measured Using an Improved Thermal Desorption Particle Beam Mass Spectrometry Method, Aerosol Science and Technology, 2005, 39, 11, 1085-1100, https://doi.org/10.1080/02786820500421547 . [all data]

Cox and Pilcher, 1970, 2
Cox, J.D.; Pilcher, G., Thermochemistry of Organic and Organometallic Compounds, Academic Press Inc., London, 1970, 643. [all data]

Ventolà, Bayés, et al., 2008
Ventolà, Lourdes; Bayés, Laura; Benages, Raül; Novegil-Anleo, Francisco Javier; Cuevas-Diarte, Miquel Ángel; Calvet, Teresa; Mondieig, Denise, Decanedioic Acid (C 10 H 18 O 4 )/Dodecanedioic Acid (C 12 H 22 O 4 ) System: Polymorphism of the Components and Experimental Phase Diagram, HCA, 2008, 91, 7, 1286-1298, https://doi.org/10.1002/hlca.200890140 . [all data]

Domalski and Hearing, 1996
Domalski, Eugene S.; Hearing, Elizabeth D., Heat Capacities and Entropies of Organic Compounds in the Condensed Phase. Volume III, J. Phys. Chem. Ref. Data, 1996, 25, 1, 1, https://doi.org/10.1063/1.555985 . [all data]